{
  "name": "versions",
  "$schema": "../../node_modules/nx/schemas/project-schema.json",
  "sourceRoot": "apps/versions/src",
  "projectType": "application",
  "targets": {
    "docker-build": {
      "executor": "@nx-tools/nx-container:build",
      "options": {
        "file": "apps/versions/Dockerfile",
        "platforms": ["linux/amd64"],
        "push": false,
        "no-cache": false,
        "version": "latest",
        "tags": ["esspass/esspass-versions"],
        "meta": {
          "enabled": true,
          "images": ["esspass/esspass-versions"]
        },
        "dependsOn": ["build"]
      }
    },
    "build": {
      "executor": "@nrwl/webpack:webpack",
      "outputs": ["{options.outputPath}"],
      "options": {
        "target": "node",
        "compiler": "tsc",
        "outputPath": "dist/apps/versions",
        "main": "apps/versions/src/main.ts",
        "tsConfig": "apps/versions/tsconfig.app.json",
        "assets": ["apps/versions/src/assets"],
        "generatePackageJson": true
      },
      "configurations": {
        "production": {
          "optimization": true,
          "extractLicenses": true,
          "inspect": false,
          "fileReplacements": [
            {
              "replace": "apps/versions/src/environments/environment.ts",
              "with": "apps/versions/src/environments/environment.prod.ts"
            }
          ]
        }
      }
    },
    "serve": {
      "executor": "@nrwl/js:node",
      "options": {
        "buildTarget": "versions:build"
      },
      "configurations": {
        "production": {
          "buildTarget": "versions:build:production"
        }
      }
    },
    "lint": {
      "executor": "@nrwl/linter:eslint",
      "outputs": ["{options.outputFile}"],
      "options": {
        "lintFilePatterns": ["apps/versions/**/*.ts"]
      }
    },
    "test": {
      "executor": "@nrwl/jest:jest",
      "outputs": ["{workspaceRoot}/coverage/{projectRoot}"],
      "options": {
        "jestConfig": "apps/versions/jest.config.ts",
        "passWithNoTests": true
      }
    },
    "integration-test": {
      "executor": "@nrwl/jest:jest",
      "outputs": ["{workspaceRoot}/coverage/{projectRoot}"],
      "options": {
        "jestConfig": "apps/versions/jest.integration-config.ts",
        "passWithNoTests": true
      }
    }
  },
  "tags": ["versions"]
}
