{
  "Version": "2012-10-17",
  "Statement": [
    {
      "Sid": "awspcaissuer",
      "Action": [
        "acm-pca:DescribeCertificateAuthority",
        "acm-pca:GetCertificate",
        "acm-pca:IssueCertificate"
      ],
      "Effect": "Allow",
      "Resource": "arn:aws:acm-pca:eu-west-1:960693787136:certificate-authority/d2e54a50-85f3-4a6d-bdf9-558c835ce905"
    }
  ]
}