<svg width="21" height="23" viewBox="0 0 21 23" fill="none" xmlns="http://www.w3.org/2000/svg">
<path d="M16.3859 22.4375L14.583 21.6461C13.8629 21.3279 13.2544 20.8276 12.8278 20.2029C12.4011 19.5781 12.1736 18.8543 12.1715 18.1149V13.0625H20.6002V18.1156C20.5981 18.8551 20.3706 19.5789 19.9439 20.2036C19.5173 20.8284 18.9088 21.3287 18.1887 21.6469L16.3859 22.4375ZM13.8573 14.625V18.1156C13.8588 18.5591 13.9954 18.9931 14.2514 19.3677C14.5075 19.7423 14.8725 20.0422 15.3045 20.2328L16.3859 20.7078L17.4672 20.2336C17.8993 20.0429 18.2644 19.7429 18.5205 19.3681C18.7765 18.9934 18.9131 18.5592 18.9144 18.1156V14.625H13.8573Z" fill="white"/>
<path d="M10.4858 20.875H2.05719V2.12502H8.80009V6.81252C8.80142 7.22654 8.97945 7.62325 9.2953 7.91601C9.61115 8.20877 10.0391 8.37379 10.4858 8.37502H15.543V10.7188H17.2287V6.81252C17.2317 6.70985 17.2106 6.60779 17.167 6.51339C17.1233 6.41898 17.0581 6.33446 16.9759 6.26565L11.0758 0.796896C11.0016 0.720603 10.9104 0.660139 10.8086 0.619675C10.7067 0.579212 10.5966 0.559712 10.4858 0.562522H2.05719C1.61051 0.563758 1.18252 0.728775 0.866671 1.02153C0.550825 1.31429 0.372794 1.711 0.37146 2.12502V20.875C0.372794 21.289 0.550825 21.6858 0.866671 21.9785C1.18252 22.2713 1.61051 22.4363 2.05719 22.4375H10.4858V20.875ZM10.4858 2.43752L15.2058 6.81252H10.4858V2.43752Z" fill="white"/>
</svg>
