{
  "name": "issuer-backoffice",
  "$schema": "../../node_modules/nx/schemas/project-schema.json",
  "sourceRoot": "apps/issuer-backoffice/src",
  "projectType": "application",
  "targets": {
    "docker-build": {
      "executor": "@nx-tools/nx-container:build",
      "options": {
        "file": "apps/issuer-backoffice/Dockerfile",
        "platforms": ["linux/amd64"],
        "push": false,
        "no-cache": false,
        "version": "latest",
        "tags": ["esspass/esspass-issuer-backoffice"],
        "meta": {
          "enabled": true,
          "images": ["esspass/esspass-issuer-backoffice"]
        },
        "dependsOn": ["build"]
      }
    },
    "build": {
      "executor": "@nrwl/webpack:webpack",
      "outputs": ["{options.outputPath}"],
      "defaultConfiguration": "production",
      "options": {
        "platform": "node",
        "outputPath": "dist/apps/issuer-backoffice",
        "bundle": true,
        "main": "apps/issuer-backoffice/src/main.ts",
        "tsConfig": "apps/issuer-backoffice/tsconfig.app.json",
        "assets": ["apps/issuer-backoffice/src/assets"],
        "generatePackageJson": true,
        "target": "node",
        "compiler": "tsc"
      },
      "configurations": {
        "development": {},
        "production": {
          "esbuildOptions": {
            "sourcemap": false,
            "outExtension": {
              ".js": ".js"
            }
          }
        }
      }
    },
    "serve": {
      "executor": "@nrwl/js:node",
      "defaultConfiguration": "development",
      "options": {
        "buildTarget": "issuer-backoffice:build"
      },
      "configurations": {
        "development": {
          "buildTarget": "issuer-backoffice:build:development"
        },
        "production": {
          "buildTarget": "issuer-backoffice:build:production"
        }
      }
    },
    "lint": {
      "executor": "@nrwl/linter:eslint",
      "outputs": ["{options.outputFile}"],
      "options": {
        "lintFilePatterns": ["apps/issuer-backoffice/**/*.ts"]
      }
    },
    "test": {
      "executor": "@nrwl/jest:jest",
      "outputs": ["{workspaceRoot}/coverage/{projectRoot}"],
      "options": {
        "jestConfig": "apps/issuer-backoffice/jest.config.ts",
        "passWithNoTests": true
      },
      "configurations": {
        "ci": {
          "ci": true,
          "codeCoverage": true
        }
      }
    }
  },
  "tags": ["issuer-backoffice"]
}
