<svg width="93" height="93" viewBox="0 0 93 93" fill="none" xmlns="http://www.w3.org/2000/svg">
<circle cx="46.5" cy="46.5" r="45.5" stroke="white" stroke-width="2"/>
<path d="M51.4446 69V64.0417L63.2229 51.9667L68.14 56.8667L56.3046 69H51.4446ZM69.7981 55.2333L64.9382 50.275L68.14 47.0083L73 51.9667L69.7981 55.2333ZM24 64.3333V27H42.2964L46.8705 31.6667H69.741V38.4333L44.755 64.3333H24Z" fill="white"/>
</svg>
