[
    {
        "id": "9cbb957e243969ac",
        "type": "tab",
        "label": "Backup",
        "disabled": false,
        "info": "",
        "env": []
    },
    {
        "id": "6f78eb33d436bdc0",
        "type": "tab",
        "label": "Metrics",
        "disabled": false,
        "info": "",
        "env": []
    },
    {
        "id": "b381220f9e27e532",
        "type": "subflow",
        "name": "Delete Dump",
        "info": "",
        "category": "",
        "in": [
            {
                "x": 80,
                "y": 120,
                "wires": [
                    {
                        "id": "ea947e8533296662"
                    }
                ]
            }
        ],
        "out": [
            {
                "x": 1020,
                "y": 100,
                "wires": [
                    {
                        "id": "d6d95477803523ba",
                        "port": 0
                    }
                ]
            },
            {
                "x": 430,
                "y": 320,
                "wires": [
                    {
                        "id": "525ea91887481ebb",
                        "port": 0
                    }
                ]
            },
            {
                "x": 660,
                "y": 220,
                "wires": [
                    {
                        "id": "2d98941a09e7b793",
                        "port": 0
                    }
                ]
            }
        ],
        "env": [],
        "meta": {},
        "color": "#DDAA99",
        "inputLabels": [
            "msg.filename"
        ],
        "outputLabels": [
            "Container not found",
            "msg.filename not found",
            "msg.filename deleted"
        ]
    },
    {
        "id": "8dfa7cef6c8d284a",
        "type": "subflow",
        "name": "Create Dump",
        "info": "",
        "category": "",
        "in": [
            {
                "x": 120,
                "y": 60,
                "wires": [
                    {
                        "id": "0851eabb77f0cb0e"
                    }
                ]
            }
        ],
        "out": [],
        "env": [],
        "meta": {},
        "color": "#DDAA99"
    },
    {
        "id": "f2324d38a803d929",
        "type": "chronos-config",
        "name": "config-chronos-scheduler",
        "latitudeType": "num",
        "longitudeType": "num",
        "timezone": "UTC",
        "sunPositions": []
    },
    {
        "id": "88f92c8f4ef90682",
        "type": "change",
        "z": "b381220f9e27e532",
        "name": "",
        "rules": [
            {
                "t": "set",
                "p": "url",
                "pt": "msg",
                "to": "$env(\"NETBOX_BASE_URL\") & \"/api/plugins/docker/containers/\"",
                "tot": "jsonata"
            },
            {
                "t": "set",
                "p": "payload",
                "pt": "msg",
                "to": "{\t    \"name\": $env(\"PG_CONTAINER_NAME\")\t}",
                "tot": "jsonata"
            },
            {
                "t": "set",
                "p": "headers",
                "pt": "msg",
                "to": "{\t    \"Authorization\": \"Token \" & $env(\"NETBOX_API_TOKEN\")\t}",
                "tot": "jsonata"
            }
        ],
        "action": "",
        "property": "",
        "from": "",
        "to": "",
        "reg": false,
        "x": 400,
        "y": 120,
        "wires": [
            [
                "53c3227890379c69"
            ]
        ]
    },
    {
        "id": "53c3227890379c69",
        "type": "http request",
        "z": "b381220f9e27e532",
        "name": "",
        "method": "GET",
        "ret": "obj",
        "paytoqs": "query",
        "url": "",
        "tls": "",
        "persist": false,
        "proxy": "",
        "insecureHTTPParser": false,
        "authType": "",
        "senderr": false,
        "headers": [],
        "x": 610,
        "y": 120,
        "wires": [
            [
                "d6d95477803523ba"
            ]
        ]
    },
    {
        "id": "d6d95477803523ba",
        "type": "switch",
        "z": "b381220f9e27e532",
        "name": "",
        "property": "msg.payload.results",
        "propertyType": "msg",
        "rules": [
            {
                "t": "empty"
            },
            {
                "t": "else"
            }
        ],
        "checkall": "true",
        "repair": false,
        "outputs": 2,
        "x": 790,
        "y": 120,
        "wires": [
            [
                "a9733c3e552c5eb7"
            ],
            [
                "99b2bb459ed23ccb"
            ]
        ]
    },
    {
        "id": "2d98941a09e7b793",
        "type": "http request",
        "z": "b381220f9e27e532",
        "name": "",
        "method": "POST",
        "ret": "txt",
        "paytoqs": "ignore",
        "url": "",
        "tls": "",
        "persist": false,
        "proxy": "",
        "insecureHTTPParser": false,
        "authType": "basic",
        "senderr": false,
        "headers": [],
        "x": 450,
        "y": 220,
        "wires": [
            [
                "296b764c3af784e6"
            ]
        ]
    },
    {
        "id": "99b2bb459ed23ccb",
        "type": "change",
        "z": "b381220f9e27e532",
        "name": "",
        "rules": [
            {
                "t": "set",
                "p": "url",
                "pt": "msg",
                "to": "msg.payload.results[0].url & \"exec\"",
                "tot": "jsonata"
            },
            {
                "t": "set",
                "p": "payload",
                "pt": "msg",
                "to": "{\t    \"cmd\": [\t        \"rm\",\t        msg.filename\t    ]\t}",
                "tot": "jsonata"
            },
            {
                "t": "set",
                "p": "headers",
                "pt": "msg",
                "to": "{    \"Authorization\": \"Token \" & $env(\"NETBOX_API_TOKEN\")}",
                "tot": "jsonata"
            }
        ],
        "action": "",
        "property": "",
        "from": "",
        "to": "",
        "reg": false,
        "x": 240,
        "y": 220,
        "wires": [
            [
                "2d98941a09e7b793"
            ]
        ]
    },
    {
        "id": "ea947e8533296662",
        "type": "fs-ops-stats",
        "z": "b381220f9e27e532",
        "name": "",
        "path": "",
        "pathType": "str",
        "filename": "filename",
        "filenameType": "msg",
        "stats": "stats",
        "sizeType": "msg",
        "x": 200,
        "y": 120,
        "wires": [
            [
                "88f92c8f4ef90682"
            ]
        ]
    },
    {
        "id": "525ea91887481ebb",
        "type": "catch",
        "z": "b381220f9e27e532",
        "name": "",
        "scope": [
            "ea947e8533296662"
        ],
        "uncaught": false,
        "x": 220,
        "y": 320,
        "wires": [
            [
                "89dd2b43e752be40"
            ]
        ]
    },
    {
        "id": "a9733c3e552c5eb7",
        "type": "change",
        "z": "b381220f9e27e532",
        "name": "Metrics",
        "rules": [
            {
                "t": "set",
                "p": "container_not_found_counter",
                "pt": "global",
                "to": "$globalContext(\"container_not_found_counter\") + 1\t",
                "tot": "jsonata"
            }
        ],
        "action": "",
        "property": "",
        "from": "",
        "to": "",
        "reg": false,
        "x": 980,
        "y": 40,
        "wires": [
            []
        ]
    },
    {
        "id": "296b764c3af784e6",
        "type": "change",
        "z": "b381220f9e27e532",
        "name": "Metrics",
        "rules": [
            {
                "t": "set",
                "p": "success_dump_deleted_counter",
                "pt": "global",
                "to": "$globalContext(\"success_dump_deleted_counter\") + 1\t",
                "tot": "jsonata"
            }
        ],
        "action": "",
        "property": "",
        "from": "",
        "to": "",
        "reg": false,
        "x": 620,
        "y": 280,
        "wires": [
            []
        ]
    },
    {
        "id": "89dd2b43e752be40",
        "type": "change",
        "z": "b381220f9e27e532",
        "name": "Metrics",
        "rules": [
            {
                "t": "set",
                "p": "failed_dump_deleted_counter",
                "pt": "global",
                "to": "$globalContext(\"failed_dump_deleted_counter\") + 1\t",
                "tot": "jsonata"
            }
        ],
        "action": "",
        "property": "",
        "from": "",
        "to": "",
        "reg": false,
        "x": 380,
        "y": 380,
        "wires": [
            []
        ]
    },
    {
        "id": "0851eabb77f0cb0e",
        "type": "change",
        "z": "8dfa7cef6c8d284a",
        "name": "",
        "rules": [
            {
                "t": "set",
                "p": "retention_dumps",
                "pt": "msg",
                "to": "RETENTION_DUMPS",
                "tot": "env"
            }
        ],
        "action": "",
        "property": "",
        "from": "",
        "to": "",
        "reg": false,
        "x": 210,
        "y": 140,
        "wires": [
            [
                "73aacd6dd5e04dd1"
            ]
        ]
    },
    {
        "id": "73aacd6dd5e04dd1",
        "type": "fs-ops-dir",
        "z": "8dfa7cef6c8d284a",
        "name": "",
        "path": "DUMP_DIRECTORY",
        "pathType": "env",
        "filter": "*",
        "filterType": "str",
        "dir": "payload",
        "dirType": "msg",
        "x": 160,
        "y": 180,
        "wires": [
            [
                "317ce0505a659260"
            ]
        ]
    },
    {
        "id": "317ce0505a659260",
        "type": "switch",
        "z": "8dfa7cef6c8d284a",
        "name": "",
        "property": "$count(msg.payload)",
        "propertyType": "jsonata",
        "rules": [
            {
                "t": "gte",
                "v": "retention_dumps",
                "vt": "msg"
            },
            {
                "t": "else"
            }
        ],
        "checkall": "true",
        "repair": false,
        "outputs": 2,
        "x": 150,
        "y": 220,
        "wires": [
            [
                "fe1cb8a587db1147"
            ],
            [
                "8e20f3df42263e07"
            ]
        ]
    },
    {
        "id": "fe1cb8a587db1147",
        "type": "change",
        "z": "8dfa7cef6c8d284a",
        "name": "",
        "rules": [
            {
                "t": "set",
                "p": "filename",
                "pt": "msg",
                "to": "$env(\"DUMP_DIRECTORY\") & \"/\" & msg.payload[0]",
                "tot": "jsonata"
            }
        ],
        "action": "",
        "property": "",
        "from": "",
        "to": "",
        "reg": false,
        "x": 470,
        "y": 220,
        "wires": [
            [
                "0660df6969a401a6"
            ]
        ]
    },
    {
        "id": "0660df6969a401a6",
        "type": "file",
        "z": "8dfa7cef6c8d284a",
        "name": "",
        "filename": "filename",
        "filenameType": "msg",
        "appendNewline": false,
        "createDir": false,
        "overwriteFile": "delete",
        "encoding": "setbymsg",
        "x": 650,
        "y": 220,
        "wires": [
            [
                "fc9b3cf05ebb31d8"
            ]
        ]
    },
    {
        "id": "67ea21e6d1fe4853",
        "type": "comment",
        "z": "8dfa7cef6c8d284a",
        "name": "↓removes from /dumps folder extra dump.",
        "info": "",
        "x": 540,
        "y": 180,
        "wires": []
    },
    {
        "id": "c20342b39abaf93c",
        "type": "comment",
        "z": "8dfa7cef6c8d284a",
        "name": "PUT create dump",
        "info": "",
        "x": 220,
        "y": 580,
        "wires": []
    },
    {
        "id": "e3e4ae65cf1b2630",
        "type": "comment",
        "z": "8dfa7cef6c8d284a",
        "name": "GET psg containers",
        "info": "",
        "x": 230,
        "y": 440,
        "wires": []
    },
    {
        "id": "8e20f3df42263e07",
        "type": "change",
        "z": "8dfa7cef6c8d284a",
        "name": "",
        "rules": [
            {
                "t": "set",
                "p": "url",
                "pt": "msg",
                "to": "$env(\"DOCKER_AGENT_BASE_URL\") & \"/api/containers\"",
                "tot": "jsonata"
            },
            {
                "t": "set",
                "p": "headers",
                "pt": "msg",
                "to": "{\t    \"Authorization\": \"Basic \" & $base64encode( $env(\"DOCKER_AGENT_USER\") & \":\" & $env(\"DOCKER_AGENT_PASS\") )  \t}",
                "tot": "jsonata"
            }
        ],
        "action": "",
        "property": "",
        "from": "",
        "to": "",
        "reg": false,
        "x": 220,
        "y": 400,
        "wires": [
            [
                "de4077d9e2afca45"
            ]
        ]
    },
    {
        "id": "de4077d9e2afca45",
        "type": "http request",
        "z": "8dfa7cef6c8d284a",
        "name": "",
        "method": "GET",
        "ret": "obj",
        "paytoqs": "ignore",
        "url": "",
        "tls": "",
        "persist": false,
        "proxy": "",
        "insecureHTTPParser": false,
        "authType": "",
        "senderr": false,
        "headers": [],
        "x": 390,
        "y": 400,
        "wires": [
            [
                "f807f0f60c12a70b",
                "87d28ba0887d7380",
                "89f602c93eb9525c"
            ]
        ]
    },
    {
        "id": "f807f0f60c12a70b",
        "type": "switch",
        "z": "8dfa7cef6c8d284a",
        "name": "",
        "property": "statusCode",
        "propertyType": "msg",
        "rules": [
            {
                "t": "gt",
                "v": "299",
                "vt": "str"
            },
            {
                "t": "else"
            }
        ],
        "checkall": "true",
        "repair": false,
        "outputs": 2,
        "x": 590,
        "y": 480,
        "wires": [
            [
                "603e99f3a189b0ce"
            ],
            [
                "d2cfe9f652e6cf36"
            ]
        ]
    },
    {
        "id": "d2cfe9f652e6cf36",
        "type": "change",
        "z": "8dfa7cef6c8d284a",
        "name": "",
        "rules": [
            {
                "t": "set",
                "p": "url",
                "pt": "msg",
                "to": "$env(\"DOCKER_AGENT_BASE_URL\") & \"/api/engine/containers/\" & msg.payload[Name=\"/\" & $env(\"PG_CONTAINER_NAME\") ].Id[0] & \"/exec\"",
                "tot": "jsonata"
            },
            {
                "t": "set",
                "p": "payload",
                "pt": "msg",
                "to": "{\t    \"cmd\": [\t        \"pg_dump\",\t        \"-U\",\t        \"netbox\",\t        \"-d\",\t        \"netbox\",\t        \"-F\",\t        \"c\",\t        \"-f\",\t        \"/dumps/\" & msg.dump_filename\t    ]\t}",
                "tot": "jsonata"
            },
            {
                "t": "set",
                "p": "headers",
                "pt": "msg",
                "to": "{\t    \"Authorization\": \"Basic \" & $base64encode( $env(\"DOCKER_AGENT_USER\") & \":\" & $env(\"DOCKER_AGENT_PASS\") )  \t}",
                "tot": "jsonata"
            }
        ],
        "action": "",
        "property": "",
        "from": "",
        "to": "",
        "reg": false,
        "x": 220,
        "y": 540,
        "wires": [
            [
                "c0cc24b68faabfa0"
            ]
        ]
    },
    {
        "id": "c0cc24b68faabfa0",
        "type": "http request",
        "z": "8dfa7cef6c8d284a",
        "name": "",
        "method": "PUT",
        "ret": "txt",
        "paytoqs": "ignore",
        "url": "",
        "tls": "",
        "persist": false,
        "proxy": "",
        "insecureHTTPParser": false,
        "authType": "basic",
        "senderr": false,
        "headers": [],
        "x": 390,
        "y": 540,
        "wires": [
            [
                "74a6a2ba09462de1",
                "7eda69f4712e959f"
            ]
        ]
    },
    {
        "id": "603e99f3a189b0ce",
        "type": "change",
        "z": "8dfa7cef6c8d284a",
        "name": "Metrics",
        "rules": [
            {
                "t": "set",
                "p": "container_not_found_counter",
                "pt": "global",
                "to": "$globalContext(\"container_not_found_counter\") + 1\t",
                "tot": "jsonata"
            }
        ],
        "action": "",
        "property": "",
        "from": "",
        "to": "",
        "reg": false,
        "x": 780,
        "y": 520,
        "wires": [
            [
                "f2ccf49380ca03aa",
                "786264721e4f89ee",
                "de6d872c03f8f2f5",
                "ecbbe2d18a26605d"
            ]
        ]
    },
    {
        "id": "ac189cde41f2f758",
        "type": "change",
        "z": "8dfa7cef6c8d284a",
        "name": "Metrics",
        "rules": [
            {
                "t": "set",
                "p": "success_dump_counter",
                "pt": "global",
                "to": "$globalContext(\"success_dump_counter\") + 1\t",
                "tot": "jsonata"
            }
        ],
        "action": "",
        "property": "",
        "from": "",
        "to": "",
        "reg": false,
        "x": 780,
        "y": 680,
        "wires": [
            [
                "7af98408850032af"
            ]
        ]
    },
    {
        "id": "de6d872c03f8f2f5",
        "type": "debug",
        "z": "8dfa7cef6c8d284a",
        "name": "",
        "active": false,
        "tosidebar": true,
        "console": false,
        "tostatus": false,
        "complete": "url",
        "targetType": "msg",
        "statusVal": "",
        "statusType": "auto",
        "x": 1020,
        "y": 480,
        "wires": []
    },
    {
        "id": "87d28ba0887d7380",
        "type": "debug",
        "z": "8dfa7cef6c8d284a",
        "name": "",
        "active": false,
        "tosidebar": true,
        "console": false,
        "tostatus": false,
        "complete": "$env(\"DOCKER_AGENT_BASE_URL\") & \"/api/engine/containers/\" & msg.payload[Name=\"/\" & $env(\"PG_CONTAINER_NAME\") ].Id[0] & \"/exec\"",
        "targetType": "jsonata",
        "statusVal": "",
        "statusType": "auto",
        "x": 600,
        "y": 440,
        "wires": []
    },
    {
        "id": "74a6a2ba09462de1",
        "type": "debug",
        "z": "8dfa7cef6c8d284a",
        "name": "",
        "active": false,
        "tosidebar": true,
        "console": false,
        "tostatus": false,
        "complete": "true",
        "targetType": "full",
        "statusVal": "",
        "statusType": "auto",
        "x": 590,
        "y": 540,
        "wires": []
    },
    {
        "id": "f2ccf49380ca03aa",
        "type": "http response",
        "z": "8dfa7cef6c8d284a",
        "name": "",
        "statusCode": "",
        "headers": {},
        "x": 970,
        "y": 560,
        "wires": []
    },
    {
        "id": "ecbbe2d18a26605d",
        "type": "debug",
        "z": "8dfa7cef6c8d284a",
        "name": "",
        "active": false,
        "tosidebar": true,
        "console": false,
        "tostatus": false,
        "complete": "payload",
        "targetType": "msg",
        "statusVal": "",
        "statusType": "auto",
        "x": 1030,
        "y": 440,
        "wires": []
    },
    {
        "id": "7eda69f4712e959f",
        "type": "switch",
        "z": "8dfa7cef6c8d284a",
        "name": "",
        "property": "statusCode",
        "propertyType": "msg",
        "rules": [
            {
                "t": "gt",
                "v": "299",
                "vt": "str"
            },
            {
                "t": "else"
            }
        ],
        "checkall": "true",
        "repair": false,
        "outputs": 2,
        "x": 590,
        "y": 620,
        "wires": [
            [
                "9e0962164a579a78"
            ],
            [
                "50276f3c5afd8522"
            ]
        ]
    },
    {
        "id": "9e0962164a579a78",
        "type": "change",
        "z": "8dfa7cef6c8d284a",
        "name": "Metrics",
        "rules": [
            {
                "t": "set",
                "p": "failed_dump_counter",
                "pt": "global",
                "to": "$globalContext(\"failed_dump_counter\") + 1\t",
                "tot": "jsonata"
            }
        ],
        "action": "",
        "property": "",
        "from": "",
        "to": "",
        "reg": false,
        "x": 780,
        "y": 560,
        "wires": [
            [
                "f2ccf49380ca03aa",
                "786264721e4f89ee",
                "de6d872c03f8f2f5",
                "ecbbe2d18a26605d"
            ]
        ]
    },
    {
        "id": "786264721e4f89ee",
        "type": "debug",
        "z": "8dfa7cef6c8d284a",
        "name": "",
        "active": false,
        "tosidebar": true,
        "console": false,
        "tostatus": false,
        "complete": "headers",
        "targetType": "msg",
        "statusVal": "",
        "statusType": "auto",
        "x": 1030,
        "y": 520,
        "wires": []
    },
    {
        "id": "3bb0e51d80446a9e",
        "type": "change",
        "z": "8dfa7cef6c8d284a",
        "name": "",
        "rules": [
            {
                "t": "set",
                "p": "payload",
                "pt": "msg",
                "to": "{\t    \"dump\": msg.new_filename,\t    \"filesize\": msg.filesize\t}",
                "tot": "jsonata"
            }
        ],
        "action": "",
        "property": "",
        "from": "",
        "to": "",
        "reg": false,
        "x": 980,
        "y": 720,
        "wires": [
            [
                "68312c403989a0c9"
            ]
        ]
    },
    {
        "id": "68312c403989a0c9",
        "type": "http response",
        "z": "8dfa7cef6c8d284a",
        "name": "",
        "statusCode": "202",
        "headers": {},
        "x": 1140,
        "y": 720,
        "wires": []
    },
    {
        "id": "fc9b3cf05ebb31d8",
        "type": "switch",
        "z": "8dfa7cef6c8d284a",
        "name": "",
        "property": "payload",
        "propertyType": "msg",
        "rules": [
            {
                "t": "cont",
                "v": "msg.payload[0]",
                "vt": "str"
            },
            {
                "t": "cont",
                "v": "dump",
                "vt": "str"
            },
            {
                "t": "else"
            }
        ],
        "checkall": "true",
        "repair": false,
        "outputs": 3,
        "x": 770,
        "y": 220,
        "wires": [
            [
                "c07e7fba7f450058"
            ],
            [
                "d4cf0daf876ad2b1"
            ],
            [
                "c07e7fba7f450058"
            ]
        ]
    },
    {
        "id": "c07e7fba7f450058",
        "type": "change",
        "z": "8dfa7cef6c8d284a",
        "name": "Metrics",
        "rules": [
            {
                "t": "set",
                "p": "failed_to_delete_dump_counter",
                "pt": "global",
                "to": "$globalContext(\"failed_to_delete_dump_counter\") + 1\t",
                "tot": "jsonata"
            }
        ],
        "action": "",
        "property": "",
        "from": "",
        "to": "",
        "reg": false,
        "x": 960,
        "y": 180,
        "wires": [
            [
                "a5dd57ff8b52b6b8"
            ]
        ]
    },
    {
        "id": "d4cf0daf876ad2b1",
        "type": "change",
        "z": "8dfa7cef6c8d284a",
        "name": "Metrics",
        "rules": [
            {
                "t": "set",
                "p": "success_deleted_dump_counter",
                "pt": "global",
                "to": "$globalContext(\"success_deleted_dump_counter\") + 1\t",
                "tot": "jsonata"
            }
        ],
        "action": "",
        "property": "",
        "from": "",
        "to": "",
        "reg": false,
        "x": 960,
        "y": 280,
        "wires": [
            [
                "8e20f3df42263e07"
            ]
        ]
    },
    {
        "id": "a5dd57ff8b52b6b8",
        "type": "http response",
        "z": "8dfa7cef6c8d284a",
        "name": "",
        "statusCode": "",
        "headers": {},
        "x": 1130,
        "y": 180,
        "wires": []
    },
    {
        "id": "09481bb356754e89",
        "type": "comment",
        "z": "8dfa7cef6c8d284a",
        "name": "Something fishy.",
        "info": "",
        "x": 980,
        "y": 140,
        "wires": []
    },
    {
        "id": "e623139fb2d14c9e",
        "type": "comment",
        "z": "8dfa7cef6c8d284a",
        "name": "Should be ok.",
        "info": "",
        "x": 970,
        "y": 240,
        "wires": []
    },
    {
        "id": "b86ad04ccc05c3a2",
        "type": "comment",
        "z": "8dfa7cef6c8d284a",
        "name": "PUT compress dump",
        "info": "",
        "x": 240,
        "y": 720,
        "wires": []
    },
    {
        "id": "50276f3c5afd8522",
        "type": "change",
        "z": "8dfa7cef6c8d284a",
        "name": "",
        "rules": [
            {
                "t": "set",
                "p": "new_filename",
                "pt": "msg",
                "to": "$substringBefore(msg.dump_filename, \".dump\") & \"-dump.tar.gz\"",
                "tot": "jsonata"
            },
            {
                "t": "set",
                "p": "payload",
                "pt": "msg",
                "to": "{\t    \"cmd\": [\t        \"tar\",\t        \"-zcf\",\t        \"/dumps/\" & $substringBefore(msg.dump_filename, \".dump\") & \"-dump.tar.gz\",\t        \"/dumps/\" & msg.dump_filename\t    ]\t}",
                "tot": "jsonata"
            },
            {
                "t": "set",
                "p": "headers",
                "pt": "msg",
                "to": "{\t    \"Authorization\": \"Basic \" & $base64encode( $env(\"DOCKER_AGENT_USER\") & \":\" & $env(\"DOCKER_AGENT_PASS\") )  \t}",
                "tot": "jsonata"
            }
        ],
        "action": "",
        "property": "",
        "from": "",
        "to": "",
        "reg": false,
        "x": 220,
        "y": 680,
        "wires": [
            [
                "d30151071928bb1a"
            ]
        ]
    },
    {
        "id": "d30151071928bb1a",
        "type": "http request",
        "z": "8dfa7cef6c8d284a",
        "name": "",
        "method": "PUT",
        "ret": "txt",
        "paytoqs": "ignore",
        "url": "",
        "tls": "",
        "persist": false,
        "proxy": "",
        "insecureHTTPParser": false,
        "authType": "basic",
        "senderr": false,
        "headers": [],
        "x": 390,
        "y": 680,
        "wires": [
            [
                "6b6b03edcd814977",
                "2418d4c355e23eed",
                "3d86235afba4ce02"
            ]
        ]
    },
    {
        "id": "6b6b03edcd814977",
        "type": "debug",
        "z": "8dfa7cef6c8d284a",
        "name": "",
        "active": false,
        "tosidebar": true,
        "console": false,
        "tostatus": false,
        "complete": "true",
        "targetType": "full",
        "statusVal": "",
        "statusType": "auto",
        "x": 610,
        "y": 720,
        "wires": []
    },
    {
        "id": "2418d4c355e23eed",
        "type": "switch",
        "z": "8dfa7cef6c8d284a",
        "name": "",
        "property": "statusCode",
        "propertyType": "msg",
        "rules": [
            {
                "t": "gt",
                "v": "299",
                "vt": "str"
            },
            {
                "t": "else"
            }
        ],
        "checkall": "true",
        "repair": false,
        "outputs": 2,
        "x": 590,
        "y": 680,
        "wires": [
            [
                "9e0962164a579a78"
            ],
            [
                "ac189cde41f2f758"
            ]
        ]
    },
    {
        "id": "89f602c93eb9525c",
        "type": "debug",
        "z": "8dfa7cef6c8d284a",
        "name": "debug 1",
        "active": true,
        "tosidebar": true,
        "console": false,
        "tostatus": false,
        "complete": "true",
        "targetType": "full",
        "statusVal": "",
        "statusType": "auto",
        "x": 600,
        "y": 400,
        "wires": []
    },
    {
        "id": "3d86235afba4ce02",
        "type": "file",
        "z": "8dfa7cef6c8d284a",
        "name": "",
        "filename": "\"/dumps/\" & msg.dump_filename",
        "filenameType": "jsonata",
        "appendNewline": false,
        "createDir": false,
        "overwriteFile": "delete",
        "encoding": "setbymsg",
        "x": 450,
        "y": 720,
        "wires": [
            []
        ]
    },
    {
        "id": "7af98408850032af",
        "type": "fs-ops-size",
        "z": "8dfa7cef6c8d284a",
        "name": "",
        "path": "/dumps/",
        "pathType": "str",
        "filename": "new_filename",
        "filenameType": "msg",
        "size": "filesize",
        "sizeType": "msg",
        "x": 780,
        "y": 720,
        "wires": [
            [
                "3bb0e51d80446a9e"
            ]
        ]
    },
    {
        "id": "c8cea02df6bb189b",
        "type": "http in",
        "z": "9cbb957e243969ac",
        "name": "",
        "url": "/api/dump",
        "method": "post",
        "upload": false,
        "swaggerDoc": "",
        "x": 140,
        "y": 300,
        "wires": [
            [
                "ca0e28e3237c8001"
            ]
        ]
    },
    {
        "id": "eefd2d8d2149514e",
        "type": "http in",
        "z": "9cbb957e243969ac",
        "name": "",
        "url": "/api/dump",
        "method": "get",
        "upload": false,
        "swaggerDoc": "",
        "x": 140,
        "y": 500,
        "wires": [
            [
                "1aff743fef3baaca"
            ]
        ]
    },
    {
        "id": "3d02abbfe1cf6a93",
        "type": "http response",
        "z": "9cbb957e243969ac",
        "name": "",
        "statusCode": "",
        "headers": {},
        "x": 950,
        "y": 500,
        "wires": []
    },
    {
        "id": "5de7a6578aa45c14",
        "type": "http in",
        "z": "9cbb957e243969ac",
        "name": "",
        "url": "/api/dump/:file",
        "method": "get",
        "upload": false,
        "swaggerDoc": "",
        "x": 150,
        "y": 660,
        "wires": [
            [
                "7cb09f71798500cb"
            ]
        ]
    },
    {
        "id": "531e10e667c56e04",
        "type": "http response",
        "z": "9cbb957e243969ac",
        "name": "",
        "statusCode": "",
        "headers": {
            "Content-Type": "application/x-gzip"
        },
        "x": 1130,
        "y": 620,
        "wires": []
    },
    {
        "id": "f41e372983a05587",
        "type": "file in",
        "z": "9cbb957e243969ac",
        "name": "",
        "filename": "filename",
        "filenameType": "msg",
        "format": "",
        "chunk": false,
        "sendError": false,
        "encoding": "none",
        "allProps": false,
        "x": 560,
        "y": 660,
        "wires": [
            [
                "3c2d18fbebc3863e",
                "e597ac15671bbc9a"
            ]
        ]
    },
    {
        "id": "7cb09f71798500cb",
        "type": "change",
        "z": "9cbb957e243969ac",
        "name": "",
        "rules": [
            {
                "t": "set",
                "p": "filename",
                "pt": "msg",
                "to": "$env(\"DUMP_DIRECTORY\") & \"/\" & msg.req.params.file",
                "tot": "jsonata"
            }
        ],
        "action": "",
        "property": "",
        "from": "",
        "to": "",
        "reg": false,
        "x": 370,
        "y": 660,
        "wires": [
            [
                "f41e372983a05587"
            ]
        ]
    },
    {
        "id": "589c33e92021841b",
        "type": "change",
        "z": "9cbb957e243969ac",
        "name": "",
        "rules": [
            {
                "t": "set",
                "p": "payload",
                "pt": "msg",
                "to": "{\t    \"dumps\": $map(msg.payload, function($e) {\t        $e\t    })\t}",
                "tot": "jsonata"
            }
        ],
        "action": "",
        "property": "",
        "from": "",
        "to": "",
        "reg": false,
        "x": 780,
        "y": 520,
        "wires": [
            [
                "3d02abbfe1cf6a93"
            ]
        ]
    },
    {
        "id": "1aff743fef3baaca",
        "type": "fs-ops-dir",
        "z": "9cbb957e243969ac",
        "name": "",
        "path": "DUMP_DIRECTORY",
        "pathType": "env",
        "filter": "*",
        "filterType": "str",
        "dir": "payload",
        "dirType": "msg",
        "x": 320,
        "y": 500,
        "wires": [
            [
                "24763e0e4ec909e1"
            ]
        ]
    },
    {
        "id": "2c78b8314343bba0",
        "type": "catch",
        "z": "9cbb957e243969ac",
        "name": "",
        "scope": [
            "f41e372983a05587"
        ],
        "uncaught": false,
        "x": 120,
        "y": 780,
        "wires": [
            [
                "3d7d66dc0c700a3c"
            ]
        ]
    },
    {
        "id": "3c398b59a6cd9e1f",
        "type": "http response",
        "z": "9cbb957e243969ac",
        "name": "",
        "statusCode": "404",
        "headers": {},
        "x": 500,
        "y": 780,
        "wires": []
    },
    {
        "id": "3d7d66dc0c700a3c",
        "type": "change",
        "z": "9cbb957e243969ac",
        "name": "",
        "rules": [
            {
                "t": "set",
                "p": "payload",
                "pt": "msg",
                "to": "{\t    \"code\": 404,\t    \"message\": \"Dump `\" & msg.req.params.file & \"` not found\"\t}",
                "tot": "jsonata"
            }
        ],
        "action": "",
        "property": "",
        "from": "",
        "to": "",
        "reg": false,
        "x": 310,
        "y": 780,
        "wires": [
            [
                "3c398b59a6cd9e1f",
                "e39f1f21cff1f629"
            ]
        ]
    },
    {
        "id": "8f689124bc7e71a2",
        "type": "http in",
        "z": "9cbb957e243969ac",
        "name": "",
        "url": "/api/dump/:file",
        "method": "delete",
        "upload": false,
        "swaggerDoc": "",
        "x": 160,
        "y": 1000,
        "wires": [
            [
                "d68bf71f288411bd"
            ]
        ]
    },
    {
        "id": "d68bf71f288411bd",
        "type": "change",
        "z": "9cbb957e243969ac",
        "name": "",
        "rules": [
            {
                "t": "set",
                "p": "filename",
                "pt": "msg",
                "to": "$env(\"DUMP_DIRECTORY\") & \"/\" & msg.req.params.file",
                "tot": "jsonata"
            }
        ],
        "action": "",
        "property": "",
        "from": "",
        "to": "",
        "reg": false,
        "x": 370,
        "y": 1000,
        "wires": [
            [
                "568b10a9b253e700"
            ]
        ]
    },
    {
        "id": "e05b84565917347c",
        "type": "http response",
        "z": "9cbb957e243969ac",
        "name": "",
        "statusCode": "204",
        "headers": {},
        "x": 1120,
        "y": 1000,
        "wires": []
    },
    {
        "id": "24763e0e4ec909e1",
        "type": "switch",
        "z": "9cbb957e243969ac",
        "name": "",
        "property": "payload",
        "propertyType": "msg",
        "rules": [
            {
                "t": "empty"
            },
            {
                "t": "else"
            }
        ],
        "checkall": "true",
        "repair": false,
        "outputs": 2,
        "x": 490,
        "y": 500,
        "wires": [
            [
                "d81f6e2751eece67"
            ],
            [
                "70c4425a4cb3ef27"
            ]
        ]
    },
    {
        "id": "d81f6e2751eece67",
        "type": "change",
        "z": "9cbb957e243969ac",
        "name": "",
        "rules": [
            {
                "t": "set",
                "p": "payload",
                "pt": "msg",
                "to": "{\"dumps\":[]}",
                "tot": "json"
            }
        ],
        "action": "",
        "property": "",
        "from": "",
        "to": "",
        "reg": false,
        "x": 780,
        "y": 480,
        "wires": [
            [
                "3d02abbfe1cf6a93"
            ]
        ]
    },
    {
        "id": "f1d0c8a2d222efff",
        "type": "inject",
        "z": "9cbb957e243969ac",
        "name": "",
        "props": [
            {
                "p": "payload"
            }
        ],
        "repeat": "",
        "crontab": "",
        "once": true,
        "onceDelay": 0.1,
        "topic": "",
        "payload": "",
        "payloadType": "date",
        "x": 130,
        "y": 140,
        "wires": [
            [
                "537473b3779b1ac9"
            ]
        ]
    },
    {
        "id": "ad410abf1124440f",
        "type": "chronos-scheduler",
        "z": "9cbb957e243969ac",
        "name": "",
        "config": "f2324d38a803d929",
        "schedule": [
            {
                "trigger": {
                    "type": "crontab",
                    "value": "0 0 1 1 *"
                },
                "output": {
                    "type": "msg",
                    "property": {
                        "name": "payload",
                        "type": "date",
                        "value": ""
                    }
                }
            }
        ],
        "disabled": false,
        "multiPort": false,
        "nextEventPort": false,
        "delayOnStart": true,
        "onStartDelay": 0.1,
        "outputs": 1,
        "x": 720,
        "y": 140,
        "wires": [
            [
                "ca0e28e3237c8001"
            ]
        ]
    },
    {
        "id": "537473b3779b1ac9",
        "type": "switch",
        "z": "9cbb957e243969ac",
        "name": "",
        "property": "SCHEDULE_DUMP",
        "propertyType": "env",
        "rules": [
            {
                "t": "nempty"
            },
            {
                "t": "else"
            }
        ],
        "checkall": "true",
        "repair": false,
        "outputs": 2,
        "x": 310,
        "y": 140,
        "wires": [
            [
                "6ad3851bf3c5b22f"
            ],
            [
                "e4b4fba8e41f8aa3"
            ]
        ]
    },
    {
        "id": "6ad3851bf3c5b22f",
        "type": "change",
        "z": "9cbb957e243969ac",
        "name": "",
        "rules": [
            {
                "t": "set",
                "p": "payload",
                "pt": "msg",
                "to": "[\t    {\t        \"type\": \"crontab\",\t        \"value\": $env(\"SCHEDULE_DUMP\")\t    }\t]",
                "tot": "jsonata"
            }
        ],
        "action": "",
        "property": "",
        "from": "",
        "to": "",
        "reg": false,
        "x": 500,
        "y": 100,
        "wires": [
            [
                "ad410abf1124440f"
            ]
        ]
    },
    {
        "id": "e4b4fba8e41f8aa3",
        "type": "change",
        "z": "9cbb957e243969ac",
        "name": "",
        "rules": [
            {
                "t": "set",
                "p": "payload",
                "pt": "msg",
                "to": "false",
                "tot": "bool"
            }
        ],
        "action": "",
        "property": "",
        "from": "",
        "to": "",
        "reg": false,
        "x": 500,
        "y": 180,
        "wires": [
            [
                "ad410abf1124440f"
            ]
        ]
    },
    {
        "id": "91944e13b38f09a5",
        "type": "subflow:8dfa7cef6c8d284a",
        "z": "9cbb957e243969ac",
        "name": "",
        "x": 650,
        "y": 300,
        "wires": []
    },
    {
        "id": "ca0e28e3237c8001",
        "type": "change",
        "z": "9cbb957e243969ac",
        "name": "",
        "rules": [
            {
                "t": "set",
                "p": "dump_filename",
                "pt": "msg",
                "to": "$replace( $now(), /[:.]+/, \"-\") & \"-\" & \"psg.dump\"",
                "tot": "jsonata"
            }
        ],
        "action": "",
        "property": "",
        "from": "",
        "to": "",
        "reg": false,
        "x": 400,
        "y": 300,
        "wires": [
            [
                "91944e13b38f09a5"
            ]
        ]
    },
    {
        "id": "3c2d18fbebc3863e",
        "type": "change",
        "z": "9cbb957e243969ac",
        "name": "Metrics",
        "rules": [
            {
                "t": "set",
                "p": "dump_downloaded_counter",
                "pt": "global",
                "to": "$globalContext(\"dump_downloaded_counter\") + 1\t",
                "tot": "jsonata"
            }
        ],
        "action": "",
        "property": "",
        "from": "",
        "to": "",
        "reg": false,
        "x": 740,
        "y": 700,
        "wires": [
            []
        ]
    },
    {
        "id": "e39f1f21cff1f629",
        "type": "change",
        "z": "9cbb957e243969ac",
        "name": "Metrics",
        "rules": [
            {
                "t": "set",
                "p": "failed_dump_retrieve_counter",
                "pt": "global",
                "to": "$globalContext(\"failed_dump_retrieve_counter\") + 1\t",
                "tot": "jsonata"
            }
        ],
        "action": "",
        "property": "",
        "from": "",
        "to": "",
        "reg": false,
        "x": 500,
        "y": 840,
        "wires": [
            []
        ]
    },
    {
        "id": "ed860ec8cf34673d",
        "type": "http in",
        "z": "9cbb957e243969ac",
        "name": "",
        "url": "/api/dump/upload/",
        "method": "post",
        "upload": true,
        "swaggerDoc": "",
        "x": 160,
        "y": 1300,
        "wires": [
            [
                "6142242859f7b3c1",
                "cfbdeb4395048079"
            ]
        ]
    },
    {
        "id": "cd1a44fbb4e2aef3",
        "type": "file",
        "z": "9cbb957e243969ac",
        "name": "",
        "filename": "filename",
        "filenameType": "msg",
        "appendNewline": false,
        "createDir": false,
        "overwriteFile": "true",
        "encoding": "base64",
        "x": 780,
        "y": 1300,
        "wires": [
            [
                "0ce1a518eed5353a"
            ]
        ]
    },
    {
        "id": "8ae6cb7a8439baab",
        "type": "debug",
        "z": "9cbb957e243969ac",
        "name": "",
        "active": false,
        "tosidebar": true,
        "console": false,
        "tostatus": false,
        "complete": "filesize",
        "targetType": "msg",
        "statusVal": "",
        "statusType": "auto",
        "x": 950,
        "y": 1340,
        "wires": []
    },
    {
        "id": "b53b011134919ff1",
        "type": "comment",
        "z": "9cbb957e243969ac",
        "name": "↑reads uploaded filesize",
        "info": "",
        "x": 800,
        "y": 1380,
        "wires": []
    },
    {
        "id": "9074308e9a644dc0",
        "type": "comment",
        "z": "9cbb957e243969ac",
        "name": "↓writes to /dumps folder",
        "info": "",
        "x": 800,
        "y": 1260,
        "wires": []
    },
    {
        "id": "6142242859f7b3c1",
        "type": "debug",
        "z": "9cbb957e243969ac",
        "name": "",
        "active": false,
        "tosidebar": true,
        "console": false,
        "tostatus": false,
        "complete": "req",
        "targetType": "msg",
        "statusVal": "",
        "statusType": "auto",
        "x": 380,
        "y": 1340,
        "wires": []
    },
    {
        "id": "7ba1f364605c14f2",
        "type": "http in",
        "z": "9cbb957e243969ac",
        "name": "",
        "url": "/api/restore/:file",
        "method": "post",
        "upload": false,
        "swaggerDoc": "",
        "x": 140,
        "y": 1600,
        "wires": [
            [
                "3bcb7e0c2e3d988c",
                "a760c4c2a2e188a1"
            ]
        ]
    },
    {
        "id": "d23ebcc01b3be2fb",
        "type": "comment",
        "z": "9cbb957e243969ac",
        "name": "PUT decompress",
        "info": "",
        "x": 720,
        "y": 1700,
        "wires": []
    },
    {
        "id": "e8addfc9be6971b6",
        "type": "comment",
        "z": "9cbb957e243969ac",
        "name": "GET psg cont.",
        "info": "",
        "x": 710,
        "y": 1560,
        "wires": []
    },
    {
        "id": "3bcb7e0c2e3d988c",
        "type": "debug",
        "z": "9cbb957e243969ac",
        "name": "",
        "active": false,
        "tosidebar": true,
        "console": false,
        "tostatus": false,
        "complete": "req",
        "targetType": "msg",
        "statusVal": "",
        "statusType": "auto",
        "x": 360,
        "y": 1560,
        "wires": []
    },
    {
        "id": "a760c4c2a2e188a1",
        "type": "change",
        "z": "9cbb957e243969ac",
        "name": "",
        "rules": [
            {
                "t": "set",
                "p": "filename",
                "pt": "msg",
                "to": "$env(\"DUMP_DIRECTORY\") & \"/\" & msg.req.params.file",
                "tot": "jsonata"
            },
            {
                "t": "set",
                "p": "filename_decompress",
                "pt": "msg",
                "to": "$env(\"DUMP_DIRECTORY\") & \"/\" & $replace( msg.req.params.file, \"-dump.tar.gz\", \".dump\")",
                "tot": "jsonata"
            }
        ],
        "action": "",
        "property": "",
        "from": "",
        "to": "",
        "reg": false,
        "x": 360,
        "y": 1600,
        "wires": [
            [
                "53087b90a19feb90"
            ]
        ]
    },
    {
        "id": "53087b90a19feb90",
        "type": "change",
        "z": "9cbb957e243969ac",
        "name": "",
        "rules": [
            {
                "t": "set",
                "p": "url",
                "pt": "msg",
                "to": "$env(\"DOCKER_AGENT_BASE_URL\") & \"/api/containers\"",
                "tot": "jsonata"
            },
            {
                "t": "set",
                "p": "headers",
                "pt": "msg",
                "to": "{\t    /*\"Authorization\": \"Basic \" & $base64encode( req.body.docker_agt_user & \":\" & req.body.docker_agt_pass ) */ \t    \"Authorization\": \"Basic \" & $base64encode( $env(\"DOCKER_AGENT_USER\") & \":\" & $env(\"DOCKER_AGENT_PASS\") )  \t}",
                "tot": "jsonata"
            }
        ],
        "action": "",
        "property": "",
        "from": "",
        "to": "",
        "reg": false,
        "x": 540,
        "y": 1600,
        "wires": [
            [
                "1a4fc60cc60edfac"
            ]
        ]
    },
    {
        "id": "1a4fc60cc60edfac",
        "type": "http request",
        "z": "9cbb957e243969ac",
        "name": "",
        "method": "GET",
        "ret": "obj",
        "paytoqs": "ignore",
        "url": "",
        "tls": "",
        "persist": false,
        "proxy": "",
        "insecureHTTPParser": false,
        "authType": "",
        "senderr": false,
        "headers": [],
        "x": 710,
        "y": 1600,
        "wires": [
            [
                "16fc44627dc8e5e0",
                "6c5a7cb2d01ea60a"
            ]
        ]
    },
    {
        "id": "16fc44627dc8e5e0",
        "type": "switch",
        "z": "9cbb957e243969ac",
        "name": "",
        "property": "statusCode",
        "propertyType": "msg",
        "rules": [
            {
                "t": "gt",
                "v": "299",
                "vt": "str"
            },
            {
                "t": "else"
            }
        ],
        "checkall": "true",
        "repair": false,
        "outputs": 2,
        "x": 690,
        "y": 1640,
        "wires": [
            [
                "653042af715ceef5"
            ],
            [
                "6810ce9df9f3cec5"
            ]
        ]
    },
    {
        "id": "6810ce9df9f3cec5",
        "type": "change",
        "z": "9cbb957e243969ac",
        "name": "",
        "rules": [
            {
                "t": "set",
                "p": "url",
                "pt": "msg",
                "to": "$env(\"DOCKER_AGENT_BASE_URL\") & \"/api/engine/containers/\" & msg.payload[Name=\"/\" & $env(\"PG_CONTAINER_NAME\") ].Id[0] & \"/exec\"",
                "tot": "jsonata"
            },
            {
                "t": "set",
                "p": "payload",
                "pt": "msg",
                "to": "{\t    \"cmd\": [\t        \"tar\",\t        \"-xf\",\t        msg.filename\t    ]\t}",
                "tot": "jsonata"
            },
            {
                "t": "set",
                "p": "headers",
                "pt": "msg",
                "to": "{\t    \"Authorization\": \"Basic \" & $base64encode( $env(\"DOCKER_AGENT_USER\") & \":\" & $env(\"DOCKER_AGENT_PASS\") )  \t}",
                "tot": "jsonata"
            }
        ],
        "action": "",
        "property": "",
        "from": "",
        "to": "",
        "reg": false,
        "x": 360,
        "y": 1700,
        "wires": [
            [
                "2bf85be2af66c439"
            ]
        ]
    },
    {
        "id": "bdc6de0af3ffb3e5",
        "type": "http request",
        "z": "9cbb957e243969ac",
        "name": "",
        "method": "PUT",
        "ret": "txt",
        "paytoqs": "ignore",
        "url": "",
        "tls": "",
        "persist": false,
        "proxy": "",
        "insecureHTTPParser": false,
        "authType": "basic",
        "senderr": false,
        "headers": [],
        "x": 710,
        "y": 1740,
        "wires": [
            [
                "403b57af9a9ce702",
                "2d150e3734abd186"
            ]
        ]
    },
    {
        "id": "5057db69fc48d8e7",
        "type": "inject",
        "z": "9cbb957e243969ac",
        "name": "",
        "props": [
            {
                "p": "payload"
            },
            {
                "p": "filename",
                "v": "/dumps/hello_world_file.txt",
                "vt": "str"
            }
        ],
        "repeat": "",
        "crontab": "",
        "once": false,
        "onceDelay": 0.1,
        "topic": "",
        "payload": "Hello, World!",
        "payloadType": "str",
        "x": 570,
        "y": 1240,
        "wires": [
            [
                "cd1a44fbb4e2aef3"
            ]
        ]
    },
    {
        "id": "653042af715ceef5",
        "type": "change",
        "z": "9cbb957e243969ac",
        "name": "Metrics",
        "rules": [
            {
                "t": "set",
                "p": "failed_dump_restore_conn_counter",
                "pt": "global",
                "to": "$globalContext(\"failed_dump_restore_conn_counter\") + 1\t",
                "tot": "jsonata"
            }
        ],
        "action": "",
        "property": "",
        "from": "",
        "to": "",
        "reg": false,
        "x": 1040,
        "y": 1640,
        "wires": [
            [
                "a4f2fb729cc3b7b4",
                "47168abc11143f7e",
                "2c3863021caf274c",
                "f08551876c4864b9"
            ]
        ]
    },
    {
        "id": "d1ecf04463da6df9",
        "type": "change",
        "z": "9cbb957e243969ac",
        "name": "Metrics",
        "rules": [
            {
                "t": "set",
                "p": "success_dump_restore_counter",
                "pt": "global",
                "to": "$globalContext(\"success_dump_restore_counter\") + 1\t",
                "tot": "jsonata"
            }
        ],
        "action": "",
        "property": "",
        "from": "",
        "to": "",
        "reg": false,
        "x": 1040,
        "y": 2040,
        "wires": [
            [
                "ad78376c542590ab"
            ]
        ]
    },
    {
        "id": "2c3863021caf274c",
        "type": "debug",
        "z": "9cbb957e243969ac",
        "name": "",
        "active": false,
        "tosidebar": true,
        "console": false,
        "tostatus": false,
        "complete": "url",
        "targetType": "msg",
        "statusVal": "",
        "statusType": "auto",
        "x": 1240,
        "y": 1680,
        "wires": []
    },
    {
        "id": "6c5a7cb2d01ea60a",
        "type": "debug",
        "z": "9cbb957e243969ac",
        "name": "",
        "active": false,
        "tosidebar": true,
        "console": false,
        "tostatus": false,
        "complete": "$env(\"DOCKER_AGENT_BASE_URL\") & \"/api/engine/containers/\" & msg.payload[Name=\"/\" & $env(\"PG_CONTAINER_NAME\") ].Id[0] & \"/exec\"",
        "targetType": "jsonata",
        "statusVal": "",
        "statusType": "auto",
        "x": 880,
        "y": 1600,
        "wires": []
    },
    {
        "id": "403b57af9a9ce702",
        "type": "debug",
        "z": "9cbb957e243969ac",
        "name": "",
        "active": false,
        "tosidebar": true,
        "console": false,
        "tostatus": false,
        "complete": "true",
        "targetType": "full",
        "statusVal": "",
        "statusType": "auto",
        "x": 870,
        "y": 1740,
        "wires": []
    },
    {
        "id": "a4f2fb729cc3b7b4",
        "type": "http response",
        "z": "9cbb957e243969ac",
        "name": "",
        "statusCode": "404",
        "headers": {},
        "x": 1260,
        "y": 1880,
        "wires": []
    },
    {
        "id": "2aacb9ee1504c796",
        "type": "http response",
        "z": "9cbb957e243969ac",
        "name": "",
        "statusCode": "",
        "headers": {},
        "x": 1330,
        "y": 1280,
        "wires": []
    },
    {
        "id": "cfbdeb4395048079",
        "type": "function",
        "z": "9cbb957e243969ac",
        "name": "toString",
        "func": "msg.name = msg.req.files[0].originalname;\n\nif (msg.req.files[0].mimetype.includes('image')) {\n    msg.payload = `<img src=\"data:image/gif;base64,${msg.req.files[0].buffer.toString('base64')}\">`;\n} else if (msg.req.files[0].mimetype.includes('gzip')){\n    msg.payload = msg.req.files[0].buffer.toString('base64');\n} else {\n    /*msg.payload = msg.req.files[0].buffer.toString();*/\n    msg.payload = msg.req.files[0].buffer.toString('base64');\n}\n\nreturn msg;",
        "outputs": 1,
        "timeout": "",
        "noerr": 0,
        "initialize": "",
        "finalize": "",
        "libs": [],
        "x": 380,
        "y": 1300,
        "wires": [
            [
                "6c1864f07d2a4649",
                "96e8f6e841294ccc"
            ]
        ]
    },
    {
        "id": "6c1864f07d2a4649",
        "type": "debug",
        "z": "9cbb957e243969ac",
        "name": "",
        "active": false,
        "tosidebar": true,
        "console": false,
        "tostatus": false,
        "complete": "payload",
        "targetType": "msg",
        "statusVal": "",
        "statusType": "auto",
        "x": 570,
        "y": 1340,
        "wires": []
    },
    {
        "id": "96e8f6e841294ccc",
        "type": "change",
        "z": "9cbb957e243969ac",
        "name": "",
        "rules": [
            {
                "t": "set",
                "p": "filename",
                "pt": "msg",
                "to": "$env(\"DUMP_DIRECTORY\") & \"/\" & msg.req.files[0].originalname",
                "tot": "jsonata"
            }
        ],
        "action": "",
        "property": "",
        "from": "",
        "to": "",
        "reg": false,
        "x": 590,
        "y": 1300,
        "wires": [
            [
                "cd1a44fbb4e2aef3"
            ]
        ]
    },
    {
        "id": "f08551876c4864b9",
        "type": "debug",
        "z": "9cbb957e243969ac",
        "name": "",
        "active": false,
        "tosidebar": true,
        "console": false,
        "tostatus": false,
        "complete": "payload",
        "targetType": "msg",
        "statusVal": "",
        "statusType": "auto",
        "x": 1250,
        "y": 1640,
        "wires": []
    },
    {
        "id": "2d150e3734abd186",
        "type": "switch",
        "z": "9cbb957e243969ac",
        "name": "",
        "property": "statusCode",
        "propertyType": "msg",
        "rules": [
            {
                "t": "neq",
                "v": "200",
                "vt": "str"
            },
            {
                "t": "else"
            }
        ],
        "checkall": "true",
        "repair": false,
        "outputs": 2,
        "x": 690,
        "y": 1780,
        "wires": [
            [
                "c16c1ed3dfe228ce"
            ],
            [
                "e1929073f484ec44"
            ]
        ]
    },
    {
        "id": "c16c1ed3dfe228ce",
        "type": "change",
        "z": "9cbb957e243969ac",
        "name": "Metrics",
        "rules": [
            {
                "t": "set",
                "p": "failed_dump_restore_counter",
                "pt": "global",
                "to": "$globalContext(\"failed_dump_restore_counter\") + 1\t",
                "tot": "jsonata"
            }
        ],
        "action": "",
        "property": "",
        "from": "",
        "to": "",
        "reg": false,
        "x": 1040,
        "y": 1880,
        "wires": [
            [
                "a4f2fb729cc3b7b4",
                "47168abc11143f7e",
                "2c3863021caf274c",
                "f08551876c4864b9"
            ]
        ]
    },
    {
        "id": "47168abc11143f7e",
        "type": "debug",
        "z": "9cbb957e243969ac",
        "name": "",
        "active": false,
        "tosidebar": true,
        "console": false,
        "tostatus": false,
        "complete": "headers",
        "targetType": "msg",
        "statusVal": "",
        "statusType": "auto",
        "x": 1250,
        "y": 1720,
        "wires": []
    },
    {
        "id": "148a846386e525e2",
        "type": "switch",
        "z": "9cbb957e243969ac",
        "name": "",
        "property": "payload",
        "propertyType": "msg",
        "rules": [
            {
                "t": "empty"
            },
            {
                "t": "else"
            }
        ],
        "checkall": "true",
        "repair": false,
        "outputs": 2,
        "x": 970,
        "y": 1300,
        "wires": [
            [
                "63553bb3848286ab"
            ],
            [
                "17f99cc0ee411f4e"
            ]
        ]
    },
    {
        "id": "17f99cc0ee411f4e",
        "type": "change",
        "z": "9cbb957e243969ac",
        "name": "Metrics",
        "rules": [
            {
                "t": "set",
                "p": "success_uploaded_dump_counter",
                "pt": "global",
                "to": "$globalContext(\"success_uploaded_dump_counter\") + 1\t",
                "tot": "jsonata"
            }
        ],
        "action": "",
        "property": "",
        "from": "",
        "to": "",
        "reg": false,
        "x": 1140,
        "y": 1320,
        "wires": [
            [
                "5d9cebb6aaa3aa85"
            ]
        ]
    },
    {
        "id": "63553bb3848286ab",
        "type": "change",
        "z": "9cbb957e243969ac",
        "name": "Metrics",
        "rules": [
            {
                "t": "set",
                "p": "failed_to_upload_dump_counter",
                "pt": "global",
                "to": "$globalContext(\"failed_to_upload_dump_counter\") + 1\t",
                "tot": "jsonata"
            }
        ],
        "action": "",
        "property": "",
        "from": "",
        "to": "",
        "reg": false,
        "x": 1140,
        "y": 1280,
        "wires": [
            [
                "2aacb9ee1504c796"
            ]
        ]
    },
    {
        "id": "fde4863213fc7116",
        "type": "comment",
        "z": "9cbb957e243969ac",
        "name": "Upload dump file.",
        "info": "",
        "x": 140,
        "y": 1260,
        "wires": []
    },
    {
        "id": "713c546e4789eebc",
        "type": "comment",
        "z": "9cbb957e243969ac",
        "name": "Restore existing dump file.",
        "info": "",
        "x": 150,
        "y": 1560,
        "wires": []
    },
    {
        "id": "f24eea3037d6dc26",
        "type": "comment",
        "z": "9cbb957e243969ac",
        "name": "Remove dump file.",
        "info": "",
        "x": 150,
        "y": 960,
        "wires": []
    },
    {
        "id": "874c002e10c78b82",
        "type": "file",
        "z": "9cbb957e243969ac",
        "name": "",
        "filename": "filename",
        "filenameType": "msg",
        "appendNewline": false,
        "createDir": false,
        "overwriteFile": "delete",
        "encoding": "setbymsg",
        "x": 590,
        "y": 1000,
        "wires": [
            [
                "62173f4c4f83c5af"
            ]
        ]
    },
    {
        "id": "fd72a9937ce7ebed",
        "type": "change",
        "z": "9cbb957e243969ac",
        "name": "Metrics",
        "rules": [
            {
                "t": "set",
                "p": "failed_to_delete_dump_counter",
                "pt": "global",
                "to": "$globalContext(\"failed_to_delete_dump_counter\") + 1\t",
                "tot": "jsonata"
            }
        ],
        "action": "",
        "property": "",
        "from": "",
        "to": "",
        "reg": false,
        "x": 760,
        "y": 1060,
        "wires": [
            [
                "c995bf1b4ed2612b"
            ]
        ]
    },
    {
        "id": "62173f4c4f83c5af",
        "type": "change",
        "z": "9cbb957e243969ac",
        "name": "Metrics",
        "rules": [
            {
                "t": "set",
                "p": "success_deleted_dump_counter",
                "pt": "global",
                "to": "$globalContext(\"success_deleted_dump_counter\") + 1\t",
                "tot": "jsonata"
            }
        ],
        "action": "",
        "property": "",
        "from": "",
        "to": "",
        "reg": false,
        "x": 760,
        "y": 1000,
        "wires": [
            [
                "e05b84565917347c"
            ]
        ]
    },
    {
        "id": "4398033e0ebf6853",
        "type": "http response",
        "z": "9cbb957e243969ac",
        "name": "",
        "statusCode": "404",
        "headers": {},
        "x": 1120,
        "y": 1060,
        "wires": []
    },
    {
        "id": "d92906012d5daae4",
        "type": "comment",
        "z": "9cbb957e243969ac",
        "name": "↓removes from /dumps folder",
        "info": "",
        "x": 660,
        "y": 960,
        "wires": []
    },
    {
        "id": "a6e5d58469dc061b",
        "type": "comment",
        "z": "9cbb957e243969ac",
        "name": "Create dump.",
        "info": "",
        "x": 130,
        "y": 260,
        "wires": []
    },
    {
        "id": "b99064a1fbb08599",
        "type": "comment",
        "z": "9cbb957e243969ac",
        "name": "Schedule create dump.",
        "info": "",
        "x": 160,
        "y": 100,
        "wires": []
    },
    {
        "id": "7098e9fe037d4303",
        "type": "comment",
        "z": "9cbb957e243969ac",
        "name": "Get dumps' list.",
        "info": "",
        "x": 140,
        "y": 460,
        "wires": []
    },
    {
        "id": "b496e7f26e963cfb",
        "type": "comment",
        "z": "9cbb957e243969ac",
        "name": "Get a dump's content.",
        "info": "",
        "x": 160,
        "y": 620,
        "wires": []
    },
    {
        "id": "568b10a9b253e700",
        "type": "fs-ops-dir",
        "z": "9cbb957e243969ac",
        "name": "",
        "path": "DUMP_DIRECTORY",
        "pathType": "env",
        "filter": "*",
        "filterType": "str",
        "dir": "payload",
        "dirType": "msg",
        "x": 400,
        "y": 1060,
        "wires": [
            [
                "6378e9c1958c15f4"
            ]
        ]
    },
    {
        "id": "6378e9c1958c15f4",
        "type": "switch",
        "z": "9cbb957e243969ac",
        "name": "",
        "property": "payload",
        "propertyType": "msg",
        "rules": [
            {
                "t": "cont",
                "v": "req.params.file",
                "vt": "msg"
            },
            {
                "t": "else"
            }
        ],
        "checkall": "true",
        "repair": false,
        "outputs": 2,
        "x": 590,
        "y": 1060,
        "wires": [
            [
                "874c002e10c78b82"
            ],
            [
                "fd72a9937ce7ebed"
            ]
        ]
    },
    {
        "id": "c995bf1b4ed2612b",
        "type": "change",
        "z": "9cbb957e243969ac",
        "name": "",
        "rules": [
            {
                "t": "set",
                "p": "payload",
                "pt": "msg",
                "to": "\"NOT FOUND -->> \" & msg.req.params.file & \"\\n\\n\" & msg.payload",
                "tot": "jsonata"
            }
        ],
        "action": "",
        "property": "",
        "from": "",
        "to": "",
        "reg": false,
        "x": 940,
        "y": 1060,
        "wires": [
            [
                "4398033e0ebf6853"
            ]
        ]
    },
    {
        "id": "e1929073f484ec44",
        "type": "switch",
        "z": "9cbb957e243969ac",
        "name": "",
        "property": "payload",
        "propertyType": "msg",
        "rules": [
            {
                "t": "neq",
                "v": "{\"stdout\":\"\"}",
                "vt": "str"
            },
            {
                "t": "else"
            }
        ],
        "checkall": "true",
        "repair": false,
        "outputs": 2,
        "x": 690,
        "y": 1820,
        "wires": [
            [
                "c16c1ed3dfe228ce"
            ],
            [
                "b57bbe31820cf41f"
            ]
        ]
    },
    {
        "id": "9f90788714650962",
        "type": "http response",
        "z": "9cbb957e243969ac",
        "name": "",
        "statusCode": "",
        "headers": {},
        "x": 1250,
        "y": 2040,
        "wires": []
    },
    {
        "id": "ad78376c542590ab",
        "type": "change",
        "z": "9cbb957e243969ac",
        "name": "",
        "rules": [
            {
                "t": "set",
                "p": "payload",
                "pt": "msg",
                "to": "Restore process seems done well.",
                "tot": "str"
            }
        ],
        "action": "",
        "property": "",
        "from": "",
        "to": "",
        "reg": false,
        "x": 1240,
        "y": 2000,
        "wires": [
            [
                "9f90788714650962"
            ]
        ]
    },
    {
        "id": "846b2883b9fc8069",
        "type": "comment",
        "z": "9cbb957e243969ac",
        "name": "PUT restore",
        "info": "",
        "x": 710,
        "y": 1920,
        "wires": []
    },
    {
        "id": "b57bbe31820cf41f",
        "type": "change",
        "z": "9cbb957e243969ac",
        "name": "",
        "rules": [
            {
                "t": "set",
                "p": "payload",
                "pt": "msg",
                "to": "{\t    \"cmd\": [\t        \"pg_restore\",\t        \"-U\",\t        \"netbox\",\t        \"-d\",\t        \"netbox\",\t        \"-F\",\t        \"c\",\t        \"-c\",\t        msg.filename_decompress\t    ]\t}",
                "tot": "jsonata"
            },
            {
                "t": "set",
                "p": "headers",
                "pt": "msg",
                "to": "{\t    \"Authorization\": \"Basic \" & $base64encode( $env(\"DOCKER_AGENT_USER\") & \":\" & $env(\"DOCKER_AGENT_PASS\") )  \t}",
                "tot": "jsonata"
            }
        ],
        "action": "",
        "property": "",
        "from": "",
        "to": "",
        "reg": false,
        "x": 540,
        "y": 1960,
        "wires": [
            [
                "87c4c804c209f097"
            ]
        ]
    },
    {
        "id": "87c4c804c209f097",
        "type": "http request",
        "z": "9cbb957e243969ac",
        "name": "",
        "method": "PUT",
        "ret": "txt",
        "paytoqs": "ignore",
        "url": "",
        "tls": "",
        "persist": false,
        "proxy": "",
        "insecureHTTPParser": false,
        "authType": "basic",
        "senderr": false,
        "headers": [],
        "x": 710,
        "y": 1960,
        "wires": [
            [
                "4b6ec1e8efc821e4",
                "11e80f4e1b811d3c"
            ]
        ]
    },
    {
        "id": "4b6ec1e8efc821e4",
        "type": "debug",
        "z": "9cbb957e243969ac",
        "name": "",
        "active": false,
        "tosidebar": true,
        "console": false,
        "tostatus": false,
        "complete": "true",
        "targetType": "full",
        "statusVal": "",
        "statusType": "auto",
        "x": 870,
        "y": 1960,
        "wires": []
    },
    {
        "id": "11e80f4e1b811d3c",
        "type": "switch",
        "z": "9cbb957e243969ac",
        "name": "",
        "property": "statusCode",
        "propertyType": "msg",
        "rules": [
            {
                "t": "neq",
                "v": "200",
                "vt": "str"
            },
            {
                "t": "else"
            }
        ],
        "checkall": "true",
        "repair": false,
        "outputs": 2,
        "x": 690,
        "y": 2000,
        "wires": [
            [
                "c16c1ed3dfe228ce"
            ],
            [
                "be095d3dd0de0708"
            ]
        ]
    },
    {
        "id": "be095d3dd0de0708",
        "type": "switch",
        "z": "9cbb957e243969ac",
        "name": "",
        "property": "payload",
        "propertyType": "msg",
        "rules": [
            {
                "t": "neq",
                "v": "{\"stdout\":\"\"}",
                "vt": "str"
            },
            {
                "t": "else"
            }
        ],
        "checkall": "true",
        "repair": false,
        "outputs": 2,
        "x": 690,
        "y": 2040,
        "wires": [
            [
                "c16c1ed3dfe228ce"
            ],
            [
                "d1ecf04463da6df9"
            ]
        ]
    },
    {
        "id": "2bf85be2af66c439",
        "type": "switch",
        "z": "9cbb957e243969ac",
        "name": "",
        "property": "$substring(msg.req.params.file, -7)",
        "propertyType": "jsonata",
        "rules": [
            {
                "t": "eq",
                "v": ".tar.gz",
                "vt": "str"
            },
            {
                "t": "else"
            }
        ],
        "checkall": "true",
        "repair": false,
        "outputs": 2,
        "x": 330,
        "y": 1740,
        "wires": [
            [
                "bdc6de0af3ffb3e5"
            ],
            [
                "cbfcb427a4533e8f"
            ]
        ]
    },
    {
        "id": "7afcdb678d442b9f",
        "type": "comment",
        "z": "9cbb957e243969ac",
        "name": "checks if it needs to decompress",
        "info": "",
        "x": 410,
        "y": 1660,
        "wires": []
    },
    {
        "id": "70c4425a4cb3ef27",
        "type": "sort",
        "z": "9cbb957e243969ac",
        "name": "",
        "order": "descending",
        "as_num": false,
        "target": "payload",
        "targetType": "msg",
        "msgKey": "payload",
        "msgKeyType": "elem",
        "seqKey": "payload",
        "seqKeyType": "msg",
        "x": 630,
        "y": 520,
        "wires": [
            [
                "589c33e92021841b"
            ]
        ]
    },
    {
        "id": "56b550956d6a9358",
        "type": "switch",
        "z": "9cbb957e243969ac",
        "name": "",
        "property": "$substring(msg.req.params.file, -7)",
        "propertyType": "jsonata",
        "rules": [
            {
                "t": "eq",
                "v": ".tar.gz",
                "vt": "str"
            },
            {
                "t": "eq",
                "v": "sg.dump",
                "vt": "str"
            },
            {
                "t": "else"
            }
        ],
        "checkall": "true",
        "repair": false,
        "outputs": 3,
        "x": 970,
        "y": 660,
        "wires": [
            [
                "531e10e667c56e04"
            ],
            [
                "fbeea03aee62d266"
            ],
            [
                "29b2bacec543cc65"
            ]
        ]
    },
    {
        "id": "fbeea03aee62d266",
        "type": "http response",
        "z": "9cbb957e243969ac",
        "name": "",
        "statusCode": "",
        "headers": {
            "Content-Type": "text/plain"
        },
        "x": 1130,
        "y": 660,
        "wires": []
    },
    {
        "id": "29b2bacec543cc65",
        "type": "http response",
        "z": "9cbb957e243969ac",
        "name": "",
        "statusCode": "",
        "headers": {
            "Content-Type": "text/plain"
        },
        "x": 1130,
        "y": 700,
        "wires": []
    },
    {
        "id": "0ce1a518eed5353a",
        "type": "fs-ops-size",
        "z": "9cbb957e243969ac",
        "name": "",
        "path": "",
        "pathType": "str",
        "filename": "filename",
        "filenameType": "msg",
        "size": "filesize",
        "sizeType": "msg",
        "x": 780,
        "y": 1340,
        "wires": [
            [
                "148a846386e525e2",
                "8ae6cb7a8439baab"
            ]
        ]
    },
    {
        "id": "5d9cebb6aaa3aa85",
        "type": "change",
        "z": "9cbb957e243969ac",
        "name": "",
        "rules": [
            {
                "t": "set",
                "p": "payload",
                "pt": "msg",
                "to": "\"Uploaded filesize: \" & msg.filesize",
                "tot": "jsonata"
            }
        ],
        "action": "",
        "property": "",
        "from": "",
        "to": "",
        "reg": false,
        "x": 1300,
        "y": 1320,
        "wires": [
            [
                "2aacb9ee1504c796"
            ]
        ]
    },
    {
        "id": "cbfcb427a4533e8f",
        "type": "switch",
        "z": "9cbb957e243969ac",
        "name": "",
        "property": "$substring(msg.req.params.file, -5)",
        "propertyType": "jsonata",
        "rules": [
            {
                "t": "eq",
                "v": ".dump",
                "vt": "str"
            },
            {
                "t": "else"
            }
        ],
        "checkall": "true",
        "repair": false,
        "outputs": 2,
        "x": 370,
        "y": 1900,
        "wires": [
            [
                "b57bbe31820cf41f"
            ],
            [
                "c16c1ed3dfe228ce"
            ]
        ]
    },
    {
        "id": "2c7831750637f24f",
        "type": "comment",
        "z": "9cbb957e243969ac",
        "name": "Failed",
        "info": "",
        "x": 1030,
        "y": 1840,
        "wires": []
    },
    {
        "id": "0b100906d18bf63d",
        "type": "comment",
        "z": "9cbb957e243969ac",
        "name": "Failed",
        "info": "",
        "x": 1030,
        "y": 1600,
        "wires": []
    },
    {
        "id": "0624d7c18d2e35b2",
        "type": "comment",
        "z": "9cbb957e243969ac",
        "name": "Failed",
        "info": "",
        "x": 1250,
        "y": 1060,
        "wires": []
    },
    {
        "id": "7648ca0edb252d3d",
        "type": "comment",
        "z": "9cbb957e243969ac",
        "name": "Succeeded",
        "info": "",
        "x": 1040,
        "y": 2000,
        "wires": []
    },
    {
        "id": "ceba5bcf69a2eab1",
        "type": "comment",
        "z": "9cbb957e243969ac",
        "name": "Succeeded",
        "info": "",
        "x": 1260,
        "y": 1000,
        "wires": []
    },
    {
        "id": "20314a03af2244b5",
        "type": "comment",
        "z": "9cbb957e243969ac",
        "name": "others",
        "info": "",
        "x": 1250,
        "y": 700,
        "wires": []
    },
    {
        "id": "d723f54410ea7b9e",
        "type": "comment",
        "z": "9cbb957e243969ac",
        "name": ".dump",
        "info": "",
        "x": 1250,
        "y": 660,
        "wires": []
    },
    {
        "id": "224b195c46ffb129",
        "type": "comment",
        "z": "9cbb957e243969ac",
        "name": ".tar.gz",
        "info": "",
        "x": 1250,
        "y": 620,
        "wires": []
    },
    {
        "id": "e597ac15671bbc9a",
        "type": "change",
        "z": "9cbb957e243969ac",
        "name": "",
        "rules": [
            {
                "t": "set",
                "p": "headers",
                "pt": "msg",
                "to": "{\t    \"Content-Disposition\": \"attachment; filename=\\\"\" & msg.req.params.file  & \"\\\"\"\t}",
                "tot": "jsonata"
            }
        ],
        "action": "",
        "property": "",
        "from": "",
        "to": "",
        "reg": false,
        "x": 760,
        "y": 660,
        "wires": [
            [
                "56b550956d6a9358"
            ]
        ]
    },
    {
        "id": "c5f7622b0fef4db2",
        "type": "http in",
        "z": "6f78eb33d436bdc0",
        "name": "",
        "url": "/api/metrics",
        "method": "get",
        "upload": false,
        "swaggerDoc": "",
        "x": 160,
        "y": 120,
        "wires": [
            [
                "c031e3ea06315dac"
            ]
        ]
    },
    {
        "id": "9b7eca9d1edf6eb1",
        "type": "http response",
        "z": "6f78eb33d436bdc0",
        "name": "",
        "statusCode": "",
        "headers": {
            "content-type": "text/plain"
        },
        "x": 510,
        "y": 120,
        "wires": []
    },
    {
        "id": "f9a69e17942ab3e0",
        "type": "inject",
        "z": "6f78eb33d436bdc0",
        "name": "",
        "props": [
            {
                "p": "payload"
            },
            {
                "p": "topic",
                "vt": "str"
            }
        ],
        "repeat": "",
        "crontab": "",
        "once": true,
        "onceDelay": 0.1,
        "topic": "",
        "payload": "",
        "payloadType": "date",
        "x": 150,
        "y": 260,
        "wires": [
            [
                "b060198c7cf30bd0"
            ]
        ]
    },
    {
        "id": "b060198c7cf30bd0",
        "type": "change",
        "z": "6f78eb33d436bdc0",
        "name": "",
        "rules": [
            {
                "t": "set",
                "p": "success_dump_counter",
                "pt": "global",
                "to": "0",
                "tot": "num"
            },
            {
                "t": "set",
                "p": "failed_dump_counter",
                "pt": "global",
                "to": "0",
                "tot": "num"
            },
            {
                "t": "set",
                "p": "container_not_found_counter",
                "pt": "global",
                "to": "0",
                "tot": "num"
            },
            {
                "t": "set",
                "p": "success_deleted_dump_counter",
                "pt": "global",
                "to": "0",
                "tot": "num"
            },
            {
                "t": "set",
                "p": "failed_to_delete_dump_counter",
                "pt": "global",
                "to": "0",
                "tot": "num"
            },
            {
                "t": "set",
                "p": "dump_downloaded_counter",
                "pt": "global",
                "to": "0",
                "tot": "num"
            },
            {
                "t": "set",
                "p": "failed_dump_retrieve_counter",
                "pt": "global",
                "to": "0",
                "tot": "num"
            },
            {
                "t": "set",
                "p": "success_uploaded_dump_counter",
                "pt": "global",
                "to": "0",
                "tot": "num"
            },
            {
                "t": "set",
                "p": "failed_to_upload_dump_counter",
                "pt": "global",
                "to": "0",
                "tot": "num"
            },
            {
                "t": "set",
                "p": "success_dump_restore_counter",
                "pt": "global",
                "to": "0",
                "tot": "num"
            },
            {
                "t": "set",
                "p": "failed_dump_restore_counter",
                "pt": "global",
                "to": "0",
                "tot": "num"
            },
            {
                "t": "set",
                "p": "failed_dump_restore_conn_counter",
                "pt": "global",
                "to": "0",
                "tot": "num"
            }
        ],
        "action": "",
        "property": "",
        "from": "",
        "to": "",
        "reg": false,
        "x": 360,
        "y": 260,
        "wires": [
            []
        ]
    },
    {
        "id": "c031e3ea06315dac",
        "type": "template",
        "z": "6f78eb33d436bdc0",
        "name": "Prometheus",
        "field": "payload",
        "fieldType": "msg",
        "format": "handlebars",
        "syntax": "mustache",
        "template": "\n####################\n# Create dump\n####################\n\n# HELP success_dump_creation_total Number of success dump requested\n# TYPE success_dump_creation_total counter\nsuccess_dump_creation_total {{global.success_dump_counter}}\n\n# HELP failed_dump_creation_total Number of dump requested but failed\n# TYPE failed_dump_creation_total counter\nfailed_dump_creation_total {{global.failed_dump_counter}}\n\n# HELP container_not_found_counter Number of times Database container was not found\n# TYPE container_not_found_counter counter\ncontainer_not_found_counter {{global.container_not_found_counter}}\n\n####################\n# Delete dump\n####################\n\n# HELP success_deleted_dump_counter Number of dumps deleted\n# TYPE success_deleted_dump_counter counter\nsuccess_deleted_dump_counter {{global.success_deleted_dump_counter}}\n\n# HELP failed_to_delete_dump_counter Number of times dump deletion failed\n# TYPE failed_to_delete_dump_counter counter\nfailed_to_delete_dump_counter {{global.failed_to_delete_dump_counter}}\n\n####################\n# Retrieve dump\n####################\n\n# HELP dump_downloaded_counter Number of dump calls that retrieved a dump correctly\n# TYPE dump_downloaded_counter counter\ndump_downloaded_counter {{global.dump_downloaded_counter}}\n\n# HELP failed_dump_retrieve_counter Number of dump calls that retrieved a dump incorrectly\n# TYPE failed_dump_retrieve_counter counter\nfailed_dump_retrieve_counter {{global.failed_dump_retrieve_counter}}\n\n####################\n# Upload dump\n####################\n\n# HELP success_uploaded_dump_counter Number of dumps uploaded\n# TYPE success_uploaded_dump_counter counter\nsuccess_uploaded_dump_counter {{global.success_uploaded_dump_counter}}\n\n# HELP failed_to_upload_dump_counter Number of times dump upload failed\n# TYPE failed_to_upload_dump_counter counter\nfailed_to_upload_dump_counter {{global.failed_to_upload_dump_counter}}\n\n####################\n# Restore dump\n####################\n\n# HELP success_dump_restore_counter Number of dumps restored\n# TYPE success_dump_restore_counter counter\nsuccess_dump_restore_counter {{global.success_dump_restore_counter}}\n\n# HELP failed_dump_restore_counter Number of times dump restore failed\n# TYPE failed_dump_restore_counter counter\nfailed_dump_restore_counter {{global.failed_dump_restore_counter}}\n\n# HELP failed_dump_restore_conn_counter Number of times dump restore connection failed\n# TYPE failed_dump_restore_conn_counter counter\nfailed_dump_restore_conn_counter {{global.failed_dump_restore_conn_counter}}",
        "output": "str",
        "x": 350,
        "y": 120,
        "wires": [
            [
                "9b7eca9d1edf6eb1"
            ]
        ]
    }
]
