{
  "issuer": {
    "id": "did:ebsi:0xA374765B14eA028E9Fe590e2019C6B38FA3Ba18B",
    "organization": {
      "id": "urn:agent:200219515",
      "legalIdentifier": "U04200078",
      "vatIdentifier": "Q9350003A",
      "taxIdentifier": "",
      "identifier": "agentIdentifier1",
      "preferredName": "Universitat Rovira i Virgili",
      "alternativeName": "Universitat Rovira i Virgili",
      "homePage": "http://www.urv.cat/",
      "escoOrganizationType": "Educational Institution",
      "siteLocation": "TarragonaF",
      "hasAccreditation": {
        "targetFramework": "Europass Accreditation Database",
        "targetResource": "https://accreditation.europass.eu/12341455"
      }
    }
  },
  "type": ["VerifiableCredential", "EuropassCredential"],
  "id": "https://app.ebsi.xyz/diploma/flemish-gov/credentials/bachelor-diploma-va",
  "title": [
    {
      "lang": "en_GB",
      "contentType": "text/plain",
      "text": "Certificate of Enrolment"
    }
  ],
  "description": [
    {
      "lang": "en_GB",
      "contentType": "text/plain",
      "text": "Attests that student has completed a 2 year course in Computer Security and Artificial Intelligence up to EQF Level 7."
    }
  ],
  "credentialSubject": {
    "id": "",
    "achievements": [
      {
        "id": "1cb8ef7e-0024-46f0-9555-61fb4280d122/ach1",
        "identifier": "achIdentifier2",
        "title": "Credit in Introductory Computer Security",
        "description": "A credit in Introductory Computer Security",
        "issuedDate": "2019-12-06T12:00:00Z",
        "partReferences": "null",
        "hasPart": [
          {
            "id": "1cb8ef7e-0024-46f0-9555-61fb4280d122/ach1",
            "identifier": "achIdentifier2",
            "title": "Credit in Introductory Computer Security",
            "description": "A credit in Introductory Computer Security",
            "issuedDate": 1573171200000,
            "partReferences": "null",
            "hasPart": "null",
            "derivedReferences": "null",
            "influencedReferences": "null",
            "wasInfluencedBy": "null",
            "wasDerivedFrom": {
              "id": "1cb8ef7e-0024-46f0-9555-61fb4280d122/amn2",
              "identifier": "amnIdentifier2",
              "title": "Unit examination",
              "description": "null",
              "partReferences": "null",
              "derivedReferences": "null",
              "hasPart": "null",
              "wasDerivedFrom": "null",
              "additionalNote": "",
              "grade": {
                "numericScore": "91%",
                "textScore": "Magna cum Laude"
              }
            },
            "entitlement": "null",
            "learningSpecification": {
              "id": "1cb8ef7e-0024-46f0-9555-61fb4280d122/lss2",
              "identifier": "LssIdenitifer2",
              "title": "Specification for Credit in Computer Security",
              "definition": "Description of the Curriculum of the Credit",
              "volumeOfLearning": "120 hours",
              "learningOutcomes": [
                {
                  "id": "1cb8ef7e-0024-46f0-9555-61fb4280d122/loo1",
                  "identifier": "null",
                  "title": "ability to apply knowledge of computing and mathematics appropriate to the discipline.",
                  "description": "null",
                  "learningOutcomeType": "skill",
                  "reusabilityLevel": "null",
                  "relatedESCOSkill": "null"
                }
              ],
              "iscedFcode": "0619: Information and Communication Technologies (ICTs)",
              "educationSubject": {
                "targetNotation": "034627",
                "targetName": "Communication Science"
              },
              "eqfLevel": "7",
              "nqfLevel": "NQF7",
              "partialQualification": false,
              "hasAccreditation": {
                "targetFramework": "Europass Accreditation Database",
                "targetResource": "https://accreditation.europass.eu/12341455"
              }
            }
          }
        ],
        "derivedReferences": "null",
        "influencedReferences": "null",
        "wasInfluencedBy": "null",
        "wasDerivedFrom": {
          "id": "1cb8ef7e-0024-46f0-9555-61fb4280d122/amn2",
          "identifier": "amnIdentifier2",
          "title": "Unit examination",
          "description": "null",
          "partReferences": "null",
          "derivedReferences": "null",
          "hasPart": "null",
          "wasDerivedFrom": "null",
          "additionalNote": "",
          "grade": {
            "numericScore": "91%",
            "textScore": "Magna cum Laude"
          }
        },
        "learningSpecification": {
          "id": "1cb8ef7e-0024-46f0-9555-61fb4280d122/lss2",
          "identifier": "LssIdenitifer2",
          "title": "Specification for Credit in Computer Security",
          "definition": "Description of the Curriculum of the Credit",
          "volumeOfLearning": "120 hours",
          "learningOutcomes": [
            {
              "id": "1cb8ef7e-0024-46f0-9555-61fb4280d122/loo1",
              "identifier": "null",
              "title": "ability to apply knowledge of computing and mathematics appropriate to the discipline.",
              "description": "null",
              "learningOutcomeType": "skill",
              "reusabilityLevel": "null",
              "relatedESCOSkill": "null"
            }
          ],
          "iscedFcode": "0619: Information and Communication Technologies (ICTs)",
          "educationSubject": {
            "targetNotation": "034627",
            "targetName": "Communication Science"
          },
          "eqfLevel": "7",
          "nqfLevel": "NQF7",
          "partialQualification": false,
          "hasAccreditation": {
            "targetFramework": "Europass Accreditation Database",
            "targetResource": "https://accreditation.europass.eu/12341455"
          }
        }
      }
    ]
  },
  "expiry": "null"
}
