{
  "sparqlEndpoint": "https://publications.europa.eu/webapi/rdf/sparql",
  "defaultQuery": "PREFIX cdm: <http://publications.europa.eu/ontology/cdm#>\nPREFIX xsd: <http://www.w3.org/2001/XMLSchema#>\nPREFIX rdf: <http://www.w3.org/1999/02/22-rdf-syntax-ns#>\n\nSELECT ?work ?date_publication ?eli ?title\nWHERE {\n\n    VALUES (?dateProperty ?startDate ?endDate) {\n        (cdm:work_date_creation \"2023-01-01\" \"2023-02-01\")\n    }\n\n    ?doc rdf:type cdm:expression ;\n        cdm:expression_title ?title ;\n        cdm:expression_belongs_to_work ?work .\n\n    ?work cdm:resource_legal_date_entry-into-force ?in_force.\n    ?work cdm:work_date_creation ?date_publication\n\n    FILTER(LANGMATCHES(lang(?title),\"en\"))\n    ?work cdm:resource_legal_id_celex ?doc_celex ;\n          cdm:resource_legal_eli ?eli .\n} %PagingString%"
}
