<?xml version="1.0" encoding="UTF-8"?>
<sitemapindex xmlns="http://www.sitemaps.org/schemas/sitemap/0.9">
  <sitemap>
    <loc>http://data.europa.eu/eli/sitemap1.xml</loc>
    <lastmod>2022-07-18T15:44:59.593+02:00</lastmod>
  </sitemap>
  <sitemap>
    <loc>http://data.europa.eu/eli/sitemap2.xml</loc>
    <lastmod>2022-07-18T15:44:59.593+02:00</lastmod>
  </sitemap>
  <sitemap>
    <loc>http://data.europa.eu/eli/sitemap3.xml</loc>
    <lastmod>2022-07-18T15:44:59.593+02:00</lastmod>
  </sitemap>
  <sitemap>
    <loc>http://data.europa.eu/eli/sitemap4.xml</loc>
    <lastmod>2022-07-18T15:44:59.593+02:00</lastmod>
  </sitemap>
  <sitemap>
    <loc>http://data.europa.eu/eli/sitemap5.xml</loc>
    <lastmod>2022-07-18T15:44:59.593+02:00</lastmod>
  </sitemap>
  <sitemap>
    <loc>http://data.europa.eu/eli/sitemap6.xml</loc>
    <lastmod>2022-07-18T15:44:59.593+02:00</lastmod>
  </sitemap>
</sitemapindex>