[
  {
    "Name": "f1",
    "Regex": "f1=(.*);"
  },
  {
    "Name": "roc_auc",
    "Regex": "roc_auc=(.*);"
  },
  {
    "Name": "accuracy",
    "Regex": "accuracy=(.*);"
  },
  {
    "Name": "coverage_err",
    "Regex": "coverage_err=(.*);"
  },
  {
    "Name": "label_ranking_average_precision",
    "Regex": "label_ranking_average_precision=(.*);"
  }
]
