,Code,Label,Weight
0,1,Settlements and other artificial areas,1
1,2,Cropland,1
2,3,"Grassland (pastures, semi-natural and natural grasslands)",1
3,4,Forest and woodland,1
4,5,Heathland and shrub,1
5,6,Sparsely vegetated ecosystems,1
6,7,Inland wetlands,1
7,8,Rivers and canals,1
8,9,Lakes and reservoirs,1
9,10,Marine inlets and transitional waters ,1
10,11,"Coastal beaches, dunes and wetlands ",1
11,12,"Marine ecosystems (offshore coastal, shelf and open ocean)",1
