ecosystem_type_L2,landcover_id,name_ecosystem_type,name_landcover
1.1,111,Continuous settlement area,Continuous urban fabric
1.2,112,Discontinuous settlement area,Discontinuous urban fabric
1.3,1,Infrastructure,Roads
1.3,121,Infrastructure,Industrial or commercial units
1.3,122,Infrastructure,Road and rail networks and associated land
1.3,123,Infrastructure,Port areas
1.3,124,Infrastructure,Airports
1.3,131,Infrastructure,Mineral extraction sites
1.3,132,Infrastructure,Dump sites
1.3,133,Infrastructure,Construction sites
1.4,141,Urban greenspace,Green urban areas
1.4,142,Urban greenspace,Sport and leisure facilities
2.1,211,Annual cropland,Non-irrigated arable land
2.1,212,Annual cropland,Permanently irrigated land
2.2,213,Rice fields,Rice fields
2.3,221,Permanent crops,Vineyards
2.3,222,Permanent crops,Fruit trees and berry plantations
2.3,223,Permanent crops,Olive groves
2.4,244,Agro-forestry areas,Agro-forestry areas
2.5,241,Mixed farmland,Annual crops associated with permanent crops
2.5,242,Mixed farmland,Complex cultivation patterns
2.5,243,Mixed farmland,"Land principally occupied by agriculture, with significant areas of natural vegetation"
3.1,231,Sown pastures and fields (modified grasslands),Pastures
3.2,321,Natural and semi-natural grasslands,Natural grasslands
4.1,311,Broadleaved deciduous forest,Broad-leaved forest
4.2,312,Coniferous forests,Coniferous forest
4.4,313,Mixed forests,Mixed forest
4.5,324,Transitional forest and woodland shrub,Transitional woodland-shrub
5.2,322,Heathland and (sub-)alpine shrub,Moors and heathland
5.3,323,Sclerophyllous vegetation,Sclerophyllous vegetation
6.1,332,Bare rocks,Bare rocks
6.2,333,(Semi-)desert and other sparsely vegetated areas,Sparsely vegetated areas
6.2,334,(Semi-)desert and other sparsely vegetated areas,Burnt areas
6.3,335,Ice sheets glaciers and perennial snow fields,Glaciers and perpetual snow
7.1,411,Inland marshes on mineral soils,Inland marshes
7.2,412,Mires bogs and fens,Peat bogs
8.2,511,Canals ditches and drains,Water courses
9.1,512,Lakes,Water bodies
10.1,521,Coastal lagoons,Coastal lagoons
10.2,522,Estuaries and bays,Estuaries
10.3,423,Intertidal flats,Intertidal flats
11.2,331,Coastal dunes beaches and sandy and muddy shores,"Beaches, dunes, sands"
11.4,421,Coastal saltmarshes and salines,Salt marshes
11.4,422,Coastal saltmarshes and salines,Salines
