NUTS_ID,2000,2001,2002,2003,2004,2005,2006,2007,2008,2009,2010,2011,2012,2013,2014,2015,2016,2017,2018,2019,2020
BE,100,101.9828027,103.65532859999999,105.57304409999999,107.5947584,109.836037,112.32350159999999,114.4932784,116.6787781,117.30088529999999,119.5203094,121.6803993,124.06669720000001,125.64390520000002,126.87853940000001,128.5665139,131.0360847,133.4318198,135.6005265,137.8453511,139.3171485
BG,100,106.124344,110.12405009999999,112.626427,118.98933740000001,126.72074579999999,135.28313789999999,150.277275,162.4970293,169.07621830000002,171.0135617,181.17518230000002,183.94214130000003,182.7122446,183.55434219999998,188.03745959999998,192.8089333,200.41121030000002,208.45220619999998,219.3964037,226.673769
CZ,100,104.88928500000002,107.7468356,109.13970330000001,113.5588193,113.6666369,114.4101364,118.46069209999999,120.84125590000001,123.968411,122.2014718,122.1763326,123.9490148,125.6405528,128.88024009999998,130.159088,131.64478970000002,133.3653138,136.7902612,142.0787071,147.98680290000001
DK,100,102.5184142,104.9251852,106.47999779999999,108.7115344,111.87115259999999,114.19379860000001,116.9713122,121.80771680000001,122.4521067,126.40005190000001,127.2072976,130.2287045,131.3853579,132.7413975,133.3162484,133.6556651,135.2390325,136.01684269999998,137.0278946,140.1946827
DE,100,101.3049949,102.7011052,104.0580472,105.2189145,105.6452692,106.064978,107.94261780000001,108.9241729,110.9304381,111.64624540000001,112.8402838,114.52892609999999,116.7729963,118.965923,121.17116909999999,122.780022,124.4426942,126.52409809999999,129.298092,131.3503709
EE,100,106.76281750000001,111.90209920000001,116.2617879,121.69683909999998,128.88708929999999,140.51649719999998,157.9631746,168.8639938,168.5683382,171.67461709999998,180.945782,188.2253179,195.835711,201.6103699,203.8658695,208.4934251,214.98330359999997,223.9701349,231.1975469,230.1713086
IE,100,106.87952150000001,112.46125659999998,116.8769864,117.46673030000001,121.0811186,125.2716528,126.80282620000001,126.29086409999998,120.3963287,116.827051,118.39872390000001,121.12028000000001,122.7357315,122.74339769999999,132.0762537,133.41403290000002,135.60530219999998,136.02841180000001,140.3110944,139.657871
EL,100,103.4747526,106.9398848,110.6331327,114.0214519,116.57589640000002,120.6502738,124.77973100000001,130.2008899,133.5467547,133.31146809999998,134.5899486,134.2191159,131.5767783,129.0153731,128.6437793,127.90192040000001,128.39714990000002,128.2641657,128.5088647,126.6331763
ES,100,104.10828640000001,108.3606932,112.6231101,116.99532260000001,121.79335209999999,126.64022250000001,130.9668188,133.9191357,134.1118524,134.3175648,134.2910361,134.1371953,134.6716509,134.3708369,135.1039051,135.5401539,137.30157260000001,138.93290969999998,140.86197140000002,142.3654842
FR,100,102.00833420000001,104.11728070000001,106.0532044,107.7741037,109.8609783,112.22884209999998,115.09812620000001,117.8225838,117.901086,119.16227099999999,120.2918819,121.68946310000001,122.63632949999999,123.34387269999999,124.7478328,125.3997143,126.05377069999999,127.25362679999999,128.8153056,131.7098072
HR,100,104.3057998,108.32897849999999,112.98402320000001,117.0627793,120.7261697,125.3785804,130.644437,137.9020714,142.00186169999998,143.3116627,145.67249669999998,147.8220055,148.9236355,149.1330685,149.2575805,149.11000900000002,150.8444924,153.8618459,156.1684732,156.80147730000002
IT,100,103.033592,106.40726409999998,109.7567604,112.68746750000001,114.9531143,117.3957,120.30593329999999,123.194122,125.26235290000001,125.8089483,127.83092079999999,129.80885049999998,131.29855,132.4976226,133.7323197,135.2493123,136.2316865,137.6786739,138.78552539999998,140.44633149999999
LV,100,102.29218459999998,107.49437420000001,112.80051270000001,120.47326159999999,133.92530259999998,150.58104330000003,180.80506630000002,201.82320900000002,182.19081819999997,181.4298622,192.9926217,199.9366301,203.2114375,207.1063336,207.113008,208.89717219999997,215.1006202,223.50015469999997,228.66907969999997,228.78938349999999
LT,100,99.67818940000001,99.99582054,99.18236003,101.8422298,108.85417790000001,116.18614380000001,126.1253869,138.3710376,133.8102746,137.20033600000002,144.5404886,148.4925919,150.3952754,151.6489584,151.74553269999998,154.1374259,160.6781424,166.34757380000002,171.0567561,172.98948769999998
LU,100,100.45700179999999,102.14549090000001,104.8858684,107.98518490000002,112.5159229,120.4320007,122.22660060000001,126.9735353,128.7486472,133.4051279,139.7733417,143.3466438,145.77769080000002,149.766368,150.041992,151.19834980000002,153.7935621,157.6566042,163.0044635,166.80338369999998
HU,100,111.0465591,120.0319014,126.5664142,133.0084494,136.50205630000002,141.49665339999999,149.19505969999997,156.34079690000002,162.89354319999998,167.0098259,170.2282103,175.14808480000002,180.0972724,186.77290369999997,191.9628428,194.5582999,202.3177274,212.0952222,222.2019444,234.87012689999997
NL,100,104.1848549,108.1131879,110.45954609999998,111.78952379999998,114.0127268,116.93271399999999,119.35580039999999,122.10853370000001,122.37802920000001,123.5288889,123.76810520000001,125.55792759999999,127.1650528,127.48701659999999,128.4721445,129.0562653,130.6832868,133.8681571,137.82770969999999,141.1395699
AT,100,101.9471054,103.11500699999999,104.4632899,106.28065749999999,108.97784180000001,111.0398781,113.50626909999998,115.72681750000001,117.9132028,118.9426499,121.1233566,123.6115158,125.61882849999999,128.3519264,131.3052769,133.7321854,134.8833661,137.19431840000001,139.5624389,141.1364854
PL,100,103.1198666,105.0277697,105.8428146,111.04673580000001,113.8886247,115.85709609999999,120.16359479999998,124.8431947,129.5691976,131.7082686,136.015883,139.2278986,139.6524225,140.38122980000003,141.7485834,142.190296,144.8346115,146.5749572,151.1908301,157.38258330000002
PT,100,103.71598279999999,108.0614561,111.7648883,114.44681489999999,118.2612165,122.02729540000001,125.6470466,127.8304459,129.23419779999998,130.06425729999998,129.7194265,129.2158604,132.1214792,133.0524023,135.7400135,138.0702115,140.15770940000002,142.69876340000002,145.181144,148.6305164
RO,100,137.95631540000002,169.2920841,208.4887128,240.71397059999998,269.6164732,298.21355839999995,345.3796932,400.6942538,417.0697394,432.055604,448.34151330000003,465.24713949999995,481.0445175,489.68868770000006,505.62975930000005,518.0027383,542.24098,575.7852295,614.8171652999999,637.9014318
SI,100,108.6752185,116.91463290000002,123.5091455,127.66021640000001,129.60138590000003,132.4799505,138.01427990000002,144.1774702,149.07904409999998,147.5445468,149.07903230000002,149.7931868,152.190411,152.88444730000003,154.4210025,155.77082030000003,158.0762094,161.4836097,165.1332629,167.23491
SK,100,105.12148880000001,109.2609866,115.07944409999999,121.68354109999999,124.7780791,128.3954869,129.8277946,133.5383703,131.9876935,132.6294017,134.85037219999998,136.55566069999998,137.26101830000002,136.9994955,136.7003645,136.0001737,137.6523627,140.4567489,143.982684,147.3943989
FI,100,103.30338090000001,104.2788378,104.4768881,105.10652979999999,106.0829077,107.0596378,110.0072902,113.348472,115.3591665,115.7316966,118.76795630000001,122.3000825,125.42887879999999,127.47540559999999,129.5363598,129.6496075,130.7117787,133.23531359999998,135.2565638,137.4972543
SE,100,102.48352299999999,104.0695983,105.83903070000001,106.1914978,106.92037830000001,108.79941170000001,111.8739669,115.4933529,118.2177315,119.33792179999999,120.6367473,121.84483030000001,122.974814,125.1201481,127.774172,129.7235074,132.49330120000002,135.6690601,139.2896051,141.2316358
UK,100,101.1150301,103.2442697,105.68957169999999,108.3670446,111.29424909999999,114.4182331,117.5076606,121.1267071,123.0848655,125.0625534,127.64803529999999,129.7616768,132.0721145,134.3587133,135.24706,138.1565496,140.83406159999998,144.0022812,147.095361,155.2843008
CY,100,103.6603047,103.9675593,109.56899240000001,112.5375103,114.81019979999999,118.35350659999999,123.25122150000001,129.0869698,129.4266222,131.8602081,133.9925283,136.23726499999998,134.9485905,133.1486751,132.35528349999998,131.61825990000003,133.0383721,134.65969109999997,135.8509478,133.8668589
MT,100,104.4165255,107.2626521,109.27016040000001,111.57923000000001,113.7410531,116.198002,118.85196599999999,122.6909894,125.17039609999999,129.1329081,130.5842355,133.3866979,136.422808,139.61882519999997,145.5109055,148.07771619999997,151.36915919999998,154.7851531,158.3675863,160.6627441
EU28,100,105.0202313,109.2837711,113.60549520000001,117.9460877,122.3357199,127.4581405,134.51588999999998,141.5398846,142.9160644,144.7085457,148.18436210000002,151.1929073,153.43628769999998,155.2713043,157.6422257,159.49548719999999,163.0418786,167.47809080000002,172.4565276,175.9329751
