prod_wd,treespec,stk_flow,unit,geo	2019	2018	2017	2016	2015	2014	2013	2012	2011	2010	2009	2008	2007	2006	2005	2004	2003	2002	2001	2000	1999	1998	1997	1996	1995	1994	1993	1992	1991	1990	1989	1988
RW,TOTAL,EXP,THS_EUR,AT	77116.87	88810.12	77839.13	82803.0	77913.0	72795.0	78994.0	74358.0	92993.0	84483.0	62528.0	81711.0	79661.0	64420.0	67719.0	80495.0	68245.0	72942.0	76303.0	75175.0	83345.63	63125.79	53918.69	46497.01	33395.24	33959.48	30168.69	39667.44	:	:	:	:
RW,TOTAL,EXP,THS_EUR,BE	:	:	169949.38	:	169949.38	161399.36	138556.79	109716.82	110125.45	90373.36	66277.73	125012.43	82708.34	108493.9	75274.0	76130.29	72432.07	69991.87	76478.65	101750.0	111145.0	:	:	:	:	:	:	:	:	:	:	:
RW,TOTAL,EXP,THS_EUR,BG	31775.47	39195.22	30006.4	31414.26	29793.05	59933.21	35788.73	50844.56	40775.13	30531.57	13604.28	17757.51	27522.33	25607.42	19025.53	15583.31	5022.24	6037.68	9012.28	10525.05	9971.45	443.33	440.66	401.26	394.99	385.09	7810.22	1835.23	:	:	:	:
RW,TOTAL,EXP,THS_EUR,CH	52678.89	62770.56	50103.45	50449.46	59462.5	65700.64	63276.74	70853.73	85266.92	66652.18	47483.44	93108.23	118402.63	117950.17	94832.8	101100.0	94387.59	105524.0	145191.92	175104.31	92334.31	57810.95	57029.24	49024.95	56421.5	54514.42	55230.13	58783.06	:	:	:	:
RW,TOTAL,EXP,THS_EUR,CY	0.0	0.0	0.0	0.0	0.0	0.0	0.0	0.0	0.0	0.0	0.0	0.0	1.71	0.0	0.0	0.0	0.0	0.0	0.87	0.66	:	149.0	145.36	131.81	126.26	0.0	0.0	20.82	:	:	:	:
RW,TOTAL,EXP,THS_EUR,CZ	658957.03	478717.12	425164.4	400184.18	336886.29	343962.34	347095.46	290723.53	281082.35	105978.25	116407.86	165630.4	194131.96	154598.48	154019.21	145589.66	162500.79	117423.41	113024.13	101833.98	139387.0	121528.39	128339.22	108823.11	91393.8	100724.11	70680.37	:	:	:	:	:
RW,TOTAL,EXP,THS_EUR,DE	680479.0	468864.0	379935.0	349165.0	330800.0	307961.0	275637.0	283813.0	315671.0	292956.0	273142.0	452431.0	583468.0	490082.0	407675.0	340594.0	301520.0	334780.0	384966.0	439449.24	367207.52	279287.64	137386.46	125163.93	197201.01	196938.99	183841.4	255379.46	:	:	:	:
RW,TOTAL,EXP,THS_EUR,DK	:	:	:	60233.3	57927.89	:	47497.8	43438.7	51428.54	46970.49	33284.64	51413.41	56534.63	35741.34	37885.92	22098.04	23422.09	23228.47	52602.62	74995.3	49895.77	34402.34	6914.58	6173.49	12304.88	7325.77	4223.24	13127.63	:	:	:	:
RW,TOTAL,EXP,THS_EUR,EE	:	226532.49	146644.43	137165.0	128264.41	152052.41	155943.27	126616.1	154955.43	119582.6	53499.39	100637.1	99770.95	67539.2	82057.24	94048.33	116376.3	112015.91	122129.41	147454.34	137403.32	136202.71	46985.15	37766.21	41977.45	19844.12	12669.82	6923.29	:	:	:	:
RW,TOTAL,EXP,THS_EUR,EL	:	:	:	:	1341.9	1718.14	2245.37	:	779.72	507.98	718.04	2057.55	2384.76	:	883.99	1033.82	1196.13	1008.55	396.33	797.21	1828.48	1729.36	20.3	18.12	17.59	19.37	975.67	3.86	:	:	:	:
RW,TOTAL,EXP,THS_EUR,ES	129480.6	106462.41	94413.93	127503.0	120527.64	174294.8	168122.77	113007.91	106660.2	67138.02	53427.02	72920.77	26918.99	20152.0	15726.0	14320.0	15829.0	15058.0	27207.39	14748.03	16981.81	25639.92	18298.01	5120.93	8252.42	7447.33	1086.36	1205.91	:	:	:	:
RW,TOTAL,EXP,THS_EUR,EU27_2020	3809854.77	3508737.65	2992385.23	:	:	:	:	:	:	:	:	:	:	:	:	:	:	:	:	:	:	:	:	:	:	:	:	:	:	:	:	:
RW,TOTAL,EXP,THS_EUR,EU28	3834429.42	3533452.01	3018008.47	2825841.31	2735360.33	2949376.96	3303056.5	2617383.55	2831237.04	2333034.6	1636165.65	2364407.93	2634932.97	2027535.21	1892664.59	1708162.0	1639175.97	1604698.89	1762301.75	2024703.7	1860575.04	:	:	:	:	:	:	:	:	:	:	:
RW,TOTAL,EXP,THS_EUR,FI	91283.9	99749.1	66046.0	62176.57	63021.88	62151.85	64012.29	57930.0	60727.41	43837.21	50289.77	68171.69	62736.6	53822.8	52067.7	39302.9	37816.9	37053.9	37944.6	46909.13	75909.94	68780.76	70080.18	60281.15	71467.94	108893.74	66963.08	27758.94	:	:	:	:
RW,TOTAL,EXP,THS_EUR,FR	323554.22	347459.24	322152.91	287521.0	308932.39	300218.11	279933.42	271984.05	352244.0	321847.0	230816.0	253243.0	288719.0	249857.0	224125.0	224211.0	226150.0	239582.0	311728.0	432870.0	276670.88	271396.03	33053.92	32681.67	37644.24	35422.79	24711.45	43400.22	:	:	:	:
RW,TOTAL,EXP,THS_EUR,HR	66254.73	65933.3	80474.42	90087.61	73954.38	78906.65	75194.89	10070.86	70282.21	58369.89	48852.88	45756.73	48864.65	41056.87	38073.31	36378.5	27992.2	31130.72	32243.1	27739.53	107515.7	99412.91	293.72	445.37	659.29	1839.89	2384.23	1705.62	:	:	:	:
RW,TOTAL,EXP,THS_EUR,HU	67424.55	54792.56	55582.66	57527.1	57290.55	66609.19	69432.17	67023.26	67785.06	61715.54	45622.97	67026.36	63274.32	54529.63	57302.96	58857.19	65172.31	61838.05	63073.39	64470.39	59113.65	55189.65	12002.57	13464.02	11212.29	11077.0	14575.87	10211.91	:	:	:	:
RW,TOTAL,EXP,THS_EUR,IE	:	10190.0	9256.0	35991.0	26245.0	29186.0	38792.0	23253.0	38172.0	37125.0	14753.0	15075.0	18440.0	10902.0	10595.0	11309.06	9992.44	8080.55	9353.9	9039.0	7746.0	7836.9	9000.95	7565.42	11873.13	9912.09	8887.73	15090.18	:	:	:	:
RW,TOTAL,EXP,THS_EUR,IS	0.0	0.0	84.22	:	:	:	:	0.02	0.01	0.0	:	0.0	0.0	0.0	0.0	0.38	:	0.52	0.29	0.0	:	0.0	0.0	0.0	0.0	0.0	0.0	0.0	:	:	:	:
RW,TOTAL,EXP,THS_EUR,IT	47086.58	20710.9	23334.23	25191.0	26524.87	23829.2	21940.01	20042.31	13943.28	9653.0	5957.84	7447.3	5987.18	5615.0	5481.0	5895.0	4816.0	2508.0	3255.0	3626.31	2738.31	1991.11	923.36	576.55	257.71	394.89	1009.38	1330.88	:	:	:	:
RW,TOTAL,EXP,THS_EUR,LT	156403.64	176908.82	121878.23	105281.13	103032.51	136386.09	477594.21	96074.48	129286.28	78188.01	36426.95	75952.28	112065.12	47095.91	48457.9	45329.06	49131.85	50002.43	46971.18	43811.88	30809.81	25245.75	10256.26	13268.78	30358.43	10152.05	4394.75	:	:	:	:	:
RW,TOTAL,EXP,THS_EUR,LU	:	:	:	:	:	:	25947.24	28315.27	33588.4	25447.98	17912.33	18625.99	21862.02	17538.08	14533.58	13525.58	10950.63	7792.0	10021.0	12312.4	19434.11	:	:	:	:	:	:	:	:	:	:	:
RW,TOTAL,EXP,THS_EUR,LV	:	:	:	165369.0	169240.46	214196.89	206731.67	208541.14	264754.1	247262.26	130993.49	195013.8	256684.02	136533.31	156971.27	157365.21	125327.53	130796.94	119974.22	131962.96	103911.11	119631.75	74325.0	47031.88	30553.13	33503.81	13109.58	:	:	:	:	:
RW,TOTAL,EXP,THS_EUR,MT	0.0	0.0	0.0	0.0	9.92	4.0	0.54	0.0	0.0	0.0	0.0	0.0	0.0	0.0	0.0	0.44	0.0	0.0	0.0	0.0	0.0	0.0	0.0	0.2	0.0	0.0	0.0	29.45	:	:	:	:
RW,TOTAL,EXP,THS_EUR,NL	35204.35	61351.94	52182.0	29420.0	29853.0	34252.6	:	28916.9	26723.55	30546.0	23506.0	33450.0	45915.0	27063.0	19756.0	24243.0	21856.0	18167.0	22946.0	10205.0	13552.6	13436.47	7392.71	6599.47	7155.86	10468.34	10148.03	13139.73	:	:	:	:
RW,TOTAL,EXP,THS_EUR,NO	219292.06	202380.72	184792.54	175111.3	207013.16	178410.54	146646.47	99901.67	59678.96	47568.31	39124.18	45326.56	46988.21	34140.82	23035.76	11978.21	13054.12	19827.13	17134.96	22247.78	22667.74	19081.73	20074.5	16682.82	18478.6	15193.58	27643.16	30630.47	:	:	:	:
RW,TOTAL,EXP,THS_EUR,PL	315290.38	317034.69	181820.83	164932.16	176093.67	193715.22	210540.29	163389.41	123204.29	118865.73	59677.98	38191.96	37214.03	41906.62	37506.34	54805.38	55485.27	41673.67	23167.13	25612.49	27140.32	22302.57	17832.32	15936.65	16715.98	49872.78	23584.07	20613.96	:	:	:	:
RW,TOTAL,EXP,THS_EUR,PT	45868.34	42242.0	30582.21	29764.0	25871.83	76656.02	102086.35	82244.08	90364.78	71578.9	42250.35	109466.13	92277.0	78486.0	69280.0	55313.0	56857.0	45531.0	47779.0	30476.1	29469.0	29700.13	5475.94	4887.46	5003.1	5822.1	4811.11	8645.53	:	:	:	:
RW,TOTAL,EXP,THS_EUR,RO	20599.36	18236.53	23464.15	13821.04	29292.59	46371.18	66863.04	43359.46	60878.29	30658.49	14874.46	22960.87	18186.07	13870.88	13974.56	17524.56	16317.62	8384.89	17180.11	52852.44	43276.11	9213.36	106.97	0.0	0.0	0.0	8.58	24.67	:	:	:	:
RW,TOTAL,EXP,THS_EUR,SE	97312.99	96873.75	113936.34	43344.74	44685.95	51580.7	57311.68	79117.66	66569.58	84984.85	69858.37	154927.09	230808.32	136920.82	142199.48	78060.45	74618.82	85952.34	59287.31	66204.71	65143.34	74395.29	98349.34	106239.85	110704.46	54369.08	34643.37	37746.0	:	:	:	:
RW,TOTAL,EXP,THS_EUR,SI	153026.36	211631.71	196054.75	202173.0	165906.04	149727.44	112331.76	91048.66	81795.73	57116.93	43927.33	45793.53	46419.01	34981.76	26505.28	15612.5	16154.69	16127.1	13814.04	13189.58	13243.47	13728.32	5366.35	4722.01	4497.3	7671.3	6143.81	8478.46	:	:	:	:
RW,TOTAL,EXP,THS_EUR,SK	142405.71	143329.6	127786.94	131325.0	144934.52	163694.67	156942.65	203233.44	158800.73	187448.02	111740.94	105067.57	84629.95	69403.53	77173.01	48087.05	52943.26	52731.34	66784.65	61544.52	50030.29	28677.63	33035.24	17920.42	15401.06	17684.68	10586.68	:	:	:	:	:
RW,TOTAL,EXP,THS_EUR,UK	24574.65	24714.36	25623.24	22157.95	37067.21	39266.43	50335.77	46330.21	37646.53	29868.52	15816.04	38667.45	47748.02	39311.15	38396.31	32449.65	21049.84	14861.08	14658.44	25148.44	17704.41	19276.6	4632.22	4068.8	3639.35	3005.65	1778.04	3342.25	:	:	:	:
RW,TOTAL,EXP,THS_M3,AT	906.08	968.2	889.79	891.0	843.62	762.55	882.63	884.32	1081.83	1030.63	805.4	1013.0	921.0	772.0	901.0	1037.0	841.0	893.0	958.0	942.0	1053.27	803.0	828.0	638.0	498.0	637.0	553.0	745.17	:	:	:	:
RW,TOTAL,EXP,THS_M3,BE	:	:	1371.0	:	1371.0	1333.5	1285.23	1077.62	1030.59	872.48	682.99	1106.74	820.58	1033.37	1113.0	1088.28	1141.52	1028.95	1041.1	1181.0	1269.0	:	:	:	:	:	:	:	:	:	:	:
RW,TOTAL,EXP,THS_M3,BG	578.79	610.4	466.84	494.0	525.36	1159.87	665.79	1031.19	919.31	679.37	278.22	413.08	892.64	578.0	556.3	460.0	224.27	224.27	308.05	360.0	227.0	256.1	256.1	243.9	92.2	23.0	202.0	142.91	:	:	:	:
RW,TOTAL,EXP,THS_M3,CH	649.32	760.8	578.11	568.0	649.34	772.54	750.0	815.84	943.77	820.3	600.22	1178.9	2027.5	1763.19	1454.81	1784.91	1784.0	2005.01	3192.92	3755.0	1239.22	1021.0	1160.0	998.0	1030.0	1074.0	1074.15	1163.84	:	:	:	:
RW,TOTAL,EXP,THS_M3,CY	0.0	0.0	0.0	0.0	0.0	0.0	0.0	0.0	0.0	0.0	0.0	0.0	0.0	0.0	0.0	0.0	0.0	0.0	0.06	0.01	0.0	2.91	4.96	4.54	4.94	0.0	0.0	0.18	:	:	:	:
RW,TOTAL,EXP,THS_M3,CZ	14385.04	8516.5	6800.8	5420.0	4690.35	5100.0	4464.0	4049.0	3599.2	1839.0	2729.61	2006.0	2511.0	2959.0	3216.0	3096.0	3174.0	2514.0	2485.0	2030.0	2798.0	2661.0	2827.0	2817.0	2335.0	725.0	1263.0	270.0	:	:	:	:
RW,TOTAL,EXP,THS_M3,DE	8769.11	5505.33	4393.67	4084.0	3915.06	3535.81	3433.95	3511.65	3774.92	3858.7	4009.84	7181.0	7757.0	7635.12	6889.0	5621.0	4607.0	4932.0	4954.0	5604.0	4598.0	4902.0	4063.0	3046.0	4983.0	4740.0	4417.0	6577.97	:	:	:	:
RW,TOTAL,EXP,THS_M3,DK	:	:	:	833.58	854.56	:	639.26	599.05	792.56	851.88	1131.31	993.96	878.82	473.02	681.48	306.46	249.53	239.6	726.0	877.0	290.0	288.0	236.0	222.0	324.8	292.0	197.36	449.02	:	:	:	:
RW,TOTAL,EXP,THS_M3,EE	:	3225.11	2823.45	2842.0	2719.32	2989.05	3080.21	2565.33	2798.62	2453.14	1275.17	1555.84	1543.75	1656.59	1923.77	2434.17	3364.98	3359.54	3682.91	4431.95	4016.24	3874.8	3041.0	1927.0	2657.3	1745.6	1108.63	531.32	:	:	:	:
RW,TOTAL,EXP,THS_M3,EL	:	:	:	:	46.78	27.5	67.92	:	311.7	207.87	232.88	1111.1	2462.68	:	16.03	16.43	18.99	16.09	3.7	9.85	232.39	223.4	57.0	59.6	59.6	63.0	28.59	42.66	:	:	:	:
RW,TOTAL,EXP,THS_M3,ES	2216.76	1603.17	1437.0	2113.0	2054.32	2765.48	2586.19	1749.09	:	1391.24	867.68	1167.43	535.59	412.0	322.0	269.0	281.0	256.0	508.0	369.0	386.75	584.0	532.3	250.9	536.7	332.2	69.0	28.09	:	:	:	:
RW,TOTAL,EXP,THS_M3,EU27_2020	56360.27	48958.54	42244.87	:	:	:	:	:	:	:	:	:	:	:	:	:	:	:	:	:	:	:	:	:	:	:	:	:	:	:	:	:
RW,TOTAL,EXP,THS_M3,EU28	56637.62	49277.53	42632.12	41491.66	40900.87	45735.2	45464.11	40200.73	44137.62	39497.58	32165.11	37264.61	41894.66	39016.55	37294.38	34084.49	33927.23	32385.66	33606.86	35481.96	30408.36	:	:	:	:	:	:	:	:	:	:	:
RW,TOTAL,EXP,THS_M3,FI	1447.3	1591.86	977.0	894.89	842.18	869.48	885.4	696.89	730.68	501.94	539.49	716.3	655.8	717.99	753.56	530.73	442.48	408.04	404.1	533.28	768.14	716.8	644.0	582.0	866.0	1445.0	912.6	331.6	:	:	:	:
RW,TOTAL,EXP,THS_M3,FR	4364.21	4650.67	4641.7	4552.0	5023.14	5056.13	5490.53	5328.87	7228.34	7478.31	5637.34	4002.98	4467.27	4254.59	4325.47	4268.58	4519.28	4618.87	5429.19	5859.12	3093.85	3257.5	2654.6	2573.4	2935.9	2824.9	2286.1	4302.56	:	:	:	:
RW,TOTAL,EXP,THS_M3,HR	782.53	782.0	1036.43	1178.0	1020.16	1346.25	1232.85	972.0	1080.0	825.0	752.0	728.0	835.0	907.0	548.0	540.26	562.0	544.0	575.0	586.0	361.0	339.1	325.1	280.9	283.4	164.0	198.09	274.8	:	:	:	:
RW,TOTAL,EXP,THS_M3,HU	712.22	707.73	822.3	956.0	947.97	1149.15	1297.61	1197.82	1160.42	1119.12	912.05	827.0	1274.0	1309.0	1117.0	1479.0	1753.0	1575.0	1515.0	1593.4	1331.9	1418.9	858.9	804.8	694.7	609.4	802.4	1334.77	:	:	:	:
RW,TOTAL,EXP,THS_M3,IE	:	109.83	81.42	378.0	306.31	332.77	357.65	201.88	311.13	349.98	285.31	262.15	308.01	308.89	337.92	255.26	341.65	129.01	51.5	42.0	176.0	91.0	262.0	250.0	304.0	124.2	188.85	415.13	:	:	:	:
RW,TOTAL,EXP,THS_M3,IS	0.0	0.0	1.0	0.0	:	:	:	11.21	0.0	0.0	:	0.0	0.0	0.0	0.0	0.0	:	0.01	0.0	0.0	:	0.0	0.0	0.0	0.0	0.0	0.0	0.0	:	:	:	:
RW,TOTAL,EXP,THS_M3,IT	426.47	115.71	213.92	204.0	242.29	192.84	204.72	176.67	105.86	47.54	27.09	33.86	17.45	16.71	15.11	17.04	10.88	16.36	23.0	24.0	15.0	16.0	10.0	7.0	5.0	9.5	21.86	46.45	:	:	:	:
RW,TOTAL,EXP,THS_M3,LI	:	:	:	:	:	:	0.0	0.0	5.0	6.0	8.0	9.0	8.0	8.0	:	:	:	:	:	:	:	0.0	0.0	0.0	0.0	:	:	:	:	:	:	:
RW,TOTAL,EXP,THS_M3,LT	2111.03	2245.85	1731.26	1638.41	1620.91	1943.19	2044.88	1593.34	1989.94	1441.96	776.25	1234.11	1718.25	1143.52	1173.92	1219.62	1453.0	1436.5	1324.69	1202.86	939.75	793.2	767.2	955.6	1769.5	889.4	285.45	285.29	:	:	:	:
RW,TOTAL,EXP,THS_M3,LU	:	:	:	:	:	:	412.32	419.7	172.57	102.16	231.4	379.43	301.6	371.98	350.06	319.93	283.62	210.34	267.77	228.35	291.4	:	:	:	:	:	:	:	:	:	:	:
RW,TOTAL,EXP,THS_M3,LV	:	:	:	3087.0	3177.67	4045.93	4030.52	4384.21	5264.35	5486.88	3548.9	3663.43	4139.64	3823.57	4265.63	4525.65	4461.42	4468.57	4095.47	4353.25	3751.0	4251.0	3139.0	1946.0	2820.0	2665.0	1219.54	478.08	:	:	:	:
RW,TOTAL,EXP,THS_M3,MT	0.0	0.0	0.0	0.0	0.04	0.01	0.01	0.0	0.0	0.0	0.0	0.0	0.0	0.0	0.0	0.01	0.0	0.0	0.0	0.0	0.0	0.0	0.0	0.01	0.0	0.0	0.0	1.03	:	:	:	:
RW,TOTAL,EXP,THS_M3,NL	838.56	885.77	891.0	433.0	580.4	528.1	:	471.1	430.46	509.1	440.2	530.0	705.5	600.2	487.4	605.3	517.0	384.5	430.5	241.0	291.0	333.5	321.0	290.6	391.0	395.0	444.0	528.38	:	:	:	:
RW,TOTAL,EXP,THS_M3,NO	3664.75	3567.53	3569.26	3559.0	4018.61	3305.28	2646.99	1628.0	962.84	883.86	872.73	899.31	952.04	745.9	524.79	349.3	399.44	552.0	475.0	515.0	583.0	494.0	478.0	385.0	436.5	435.6	685.0	941.47	:	:	:	:
RW,TOTAL,EXP,THS_M3,PL	4601.63	5571.37	2963.98	2735.0	2663.78	2911.92	3072.89	2002.92	1904.25	1733.54	1089.25	435.93	387.47	490.0	603.8	1027.8	1008.5	723.3	310.0	347.2	390.8	362.6	288.7	237.4	239.2	759.0	593.47	1047.24	:	:	:	:
RW,TOTAL,EXP,THS_M3,PT	478.76	514.18	523.41	324.0	305.47	1042.95	1265.06	1007.53	1132.57	1002.96	616.78	1346.91	1535.0	1430.0	1279.0	1011.0	1019.0	822.0	812.0	570.1	557.2	585.4	646.0	471.5	798.0	643.0	401.25	563.56	:	:	:	:
RW,TOTAL,EXP,THS_M3,RO	160.63	105.55	186.96	158.0	315.77	529.73	774.63	586.53	831.85	429.27	224.72	257.05	179.0	190.09	159.0	186.0	211.0	94.6	112.0	535.1	603.4	161.0	13.0	0.0	0.0	0.0	1.16	0.05	:	:	:	:
RW,TOTAL,EXP,THS_M3,SE	886.54	791.06	980.91	600.0	632.83	644.47	775.37	819.81	892.23	1256.04	1208.65	2453.08	3886.0	3045.17	3126.89	1558.16	1533.01	1785.19	1340.45	1461.81	1335.42	1454.5	1404.0	1631.0	1738.0	1068.0	843.0	649.92	:	:	:	:
RW,TOTAL,EXP,THS_M3,SI	1945.88	2695.0	2703.75	3084.0	2682.66	2384.83	1549.74	1323.54	1142.43	844.02	766.94	724.37	705.73	545.68	422.58	244.13	280.46	263.86	231.34	217.32	233.62	236.3	226.98	135.92	137.14	191.15	201.43	295.43	:	:	:	:
RW,TOTAL,EXP,THS_M3,SK	1750.09	2099.58	2015.62	2449.0	2642.82	3391.5	3121.86	2395.62	2683.6	2563.7	2685.69	2289.33	1533.0	1233.0	1815.0	1210.0	1189.0	1286.0	1828.0	1612.0	1232.0	735.0	1081.0	567.0	919.0	1110.0	322.18	0.0	:	:	:	:
RW,TOTAL,EXP,THS_M3,UK	277.35	318.99	387.25	725.0	876.1	694.18	1013.78	1022.29	724.46	621.76	409.94	832.53	922.9	789.6	895.48	757.69	439.64	156.06	190.03	270.36	166.24	356.3	70.0	54.4	62.4	50.3	38.0	143.7	:	:	:	:
RW,TOTAL,EXP,THS_NAC,AT	77116.87	88810.12	77839.13	82803.0	77913.0	72795.0	78994.0	74358.0	92993.0	84483.0	62528.0	81711.0	79661.0	64420.0	67719.0	80495.0	68245.0	72942.0	76303.0	75175.0	83345.63	63557.85	54168.43	45396.01	31992.68	33414.68	29869.42	40983.76	:	:	:	:
RW,TOTAL,EXP,THS_NAC,BE	:	:	169949.38	:	169949.38	161399.36	138556.79	109716.82	110125.45	90373.36	66277.73	125012.43	82708.34	108493.9	75274.0	76130.29	72432.07	69991.87	76478.65	101750.0	111145.0	:	:	:	:	:	:	:	:	:	:	:
RW,TOTAL,EXP,THS_NAC,BG	62146.47	76658.01	58686.52	61440.0	58269.25	117217.37	69995.59	99441.79	79747.99	59713.65	26607.26	34730.14	53828.17	50083.0	37210.14	30438.88	9788.34	11768.64	17557.72	20547.0	19502.16	872.96	833.28	89.28	34.72	24.8	252.27	93.78	:	:	:	:
RW,TOTAL,EXP,THS_NAC,CH	58600.0	72500.0	55700.0	54900.0	63500.0	79800.0	77900.0	85400.0	105100.0	92000.0	71700.0	147800.0	194500.0	185523.83	146829.62	156078.18	143582.4	154803.71	219312.4	272795.0	147762.59	93769.36	93756.08	76866.23	87210.71	88384.23	95559.16	106855.85	:	:	:	:
RW,TOTAL,EXP,THS_NAC,CY	0.0	0.0	0.0	0.0	0.0	0.0	0.0	0.0	0.0	0.0	0.0	0.0	1.7	0.0	0.0	0.0	0.0	0.0	0.85	0.65	:	147.49	144.65	133.31	127.63	0.0	0.0	20.76	:	:	:	:
RW,TOTAL,EXP,THS_NAC,CZ	16915427.0	12277658.0	11192878.0	10818579.0	9189921.0	9471347.0	9017540.0	7311406.0	6911815.0	2679554.0	3077241.81	4131816.0	5390268.0	4381630.0	4587000.0	4643000.0	5175000.0	3617110.62	3850506.18	3625187.71	5141150.15	4380977.04	4611228.14	3749718.04	3170999.2	3439829.2	2415077.5	0.0	:	:	:	:
RW,TOTAL,EXP,THS_NAC,DE	680479.0	468864.0	379935.0	349165.0	330800.0	307961.0	275637.0	283813.0	315671.0	292956.0	273142.0	452431.0	583468.0	490082.0	407675.0	340594.0	301520.0	334780.0	384966.0	439449.24	367207.52	281186.6	137986.79	122201.64	188925.08	193786.76	182013.72	263798.87	:	:	:	:
RW,TOTAL,EXP,THS_NAC,DK	:	:	:	448448.94	432066.74	63428.81	354233.87	323344.65	383173.49	349803.33	247844.09	383338.36	421216.91	266598.23	282318.27	164407.22	174042.5	172599.15	392000.0	559000.0	371000.0	257993.48	51745.94	45432.58	90170.15	55260.46	32069.57	102517.63	:	:	:	:
RW,TOTAL,EXP,THS_NAC,EE	:	226532.49	146644.43	137165.0	128264.41	152052.41	155943.27	126616.1	154955.43	119582.6	53499.39	100637.1	99770.95	67539.2	82057.24	94048.33	116376.3	112015.91	122129.41	147454.34	137403.32	137086.68	47184.51	36864.39	40200.75	19522.44	12538.49	7153.03	:	:	:	:
RW,TOTAL,EXP,THS_NAC,EL	:	:	:	:	1341.9	1718.14	2245.37	:	779.72	507.98	718.04	2057.55	2384.76	2006.52	883.99	1033.82	1196.13	1008.55	396.33	787.57	1748.04	1678.51	18.43	16.25	15.64	16.38	768.99	2.8	:	:	:	:
RW,TOTAL,EXP,THS_NAC,ES	129480.6	106462.41	94413.93	127503.0	120527.64	174294.8	168122.77	113007.91	106660.2	67138.02	53427.02	72920.77	26918.99	20152.0	15726.0	14320.0	15829.0	15058.0	27207.39	14748.03	16981.81	25762.93	18243.1	4947.39	8084.48	7113.09	973.65	960.5	:	:	:	:
RW,TOTAL,EXP,THS_NAC,EU27_2020	44826082.32	35572131.33	33486904.97	:	:	:	:	:	:	:	:	:	:	:	:	:	:	:	:	:	:	:	:	:	:	:	:	:	:	:	:	:
RW,TOTAL,EXP,THS_NAC,EU28	44847653.21	35593996.37	33509368.09	:	:	:	:	:	:	:	:	:	:	:	:	:	:	:	:	:	:	:	:	:	:	:	:	:	:	:	:	:
RW,TOTAL,EXP,THS_NAC,FI	91283.9	99749.1	66046.0	62176.57	63021.88	62151.85	64012.29	57930.0	60727.41	43837.21	50289.77	68171.69	62736.6	53822.8	52067.7	39302.9	37816.9	37053.9	37944.6	46909.13	75909.94	69206.22	69313.02	59089.21	68616.97	113381.49	75416.03	27111.41	:	:	:	:
RW,TOTAL,EXP,THS_NAC,FR	323554.22	347459.24	322152.91	287521.0	308932.39	300218.11	279933.42	271984.05	352244.0	321847.0	230816.0	253243.0	288719.0	249857.0	224125.0	224211.0	226150.0	239582.0	311728.0	432870.0	276670.88	273127.19	33321.14	32349.99	37446.16	35547.23	24990.64	45311.13	:	:	:	:
RW,TOTAL,EXP,THS_NAC,HR	491477.6	489106.39	600636.92	678657.0	563066.46	602404.92	569872.01	75750.0	522829.34	425463.95	358580.15	330542.05	358549.24	300729.22	281772.92	272718.73	211867.4	230772.01	241242.84	212017.7	814464.72	709845.96	2043.5	3029.94	4455.96	13054.95	9938.08	581.36	:	:	:	:
RW,TOTAL,EXP,THS_NAC,HU	21933207.67	17472797.99	17185603.0	17916241.0	17760070.53	20562923.1	20612329.28	19386478.14	18937111.32	17001397.78	12789486.25	16857800.05	15904000.0	14410000.0	14214000.0	14812000.0	16529000.0	15024173.67	16184000.59	16764880.98	14942157.48	13276975.14	2540344.0	2608788.5	1844982.4	1384957.2	1568509.66	1764413.2	:	:	:	:
RW,TOTAL,EXP,THS_NAC,IE	:	10190.0	9256.0	35991.0	26245.0	29186.0	38792.0	23253.0	38172.0	37125.0	14753.0	15075.0	18440.0	10902.0	10595.0	11309.06	9992.44	8080.55	9353.9	9039.0	7746.0	7823.78	8543.25	7621.94	12294.66	9988.28	9027.53	14575.79	:	:	:	:
RW,TOTAL,EXP,THS_NAC,IS	0.0	0.0	10152.0	0.0	:	:	:	3.09	1.69	0.0	:	0.0	0.0	0.0	0.0	33.0	:	45.0	25.0	0.0	:	0.0	0.0	0.0	0.0	0.0	0.0	0.0	:	:	:	:
RW,TOTAL,EXP,THS_NAC,IT	47086.58	20710.9	23334.23	25191.0	26524.87	23829.2	21940.01	20042.31	13943.28	9653.0	5957.84	7447.3	5987.18	5615.0	5481.0	5895.0	4816.0	2508.0	3255.0	3626.31	2738.31	1998.69	920.04	583.31	283.51	390.56	959.84	1096.67	:	:	:	:
RW,TOTAL,EXP,THS_NAC,LI	:	:	:	:	:	:	0.0	0.0	475.32	556.09	777.35	925.43	399.5	720.0	:	:	:	:	:	:	:	:	:	:	:	:	:	:	:	:	:	:
RW,TOTAL,EXP,THS_NAC,LT	156403.64	176908.82	121878.23	105281.13	103032.51	136386.09	477594.21	96074.48	129286.28	78188.01	36426.95	75952.28	112065.12	47095.91	48457.9	45329.85	49131.14	50098.44	48732.74	46887.4	38048.89	32788.23	13474.28	19518.07	46002.09	13912.94	6474.55	2673.51	:	:	:	:
RW,TOTAL,EXP,THS_NAC,LU	:	:	:	:	:	:	25947.24	28315.27	33588.4	25447.98	17912.33	18625.99	21862.02	17538.08	14533.58	13525.58	10950.63	7792.0	10021.0	12312.4	19434.11	:	:	:	:	:	:	:	:	:	:	:
RW,TOTAL,EXP,THS_NAC,LV	:	:	:	165369.0	169240.46	214196.89	206348.1	206907.95	266071.1	249336.61	131533.26	194984.95	255696.44	135250.35	155496.27	148945.28	114252.84	108128.33	95613.51	104998.96	92496.33	112386.47	69734.95	46817.82	29976.35	31658.78	14803.22	12312.11	:	:	:	:
RW,TOTAL,EXP,THS_NAC,MT	0.0	0.0	0.0	0.0	9.92	4.0	0.54	0.0	0.0	0.0	0.0	0.0	0.0	0.0	0.0	0.44	0.0	0.0	0.0	0.0	0.0	0.0	0.0	0.21	0.0	0.0	0.0	28.33	:	:	:	:
RW,TOTAL,EXP,THS_NAC,NL	35204.35	61351.94	52182.0	29420.0	29853.0	34252.6	:	28916.9	26723.55	30546.0	23506.0	33450.0	45915.0	27063.0	19756.0	24243.0	21856.0	18167.0	22946.0	10205.0	13552.6	13533.74	7416.51	6407.88	6815.57	10252.47	10016.8	13563.71	:	:	:	:
RW,TOTAL,EXP,THS_NAC,NO	2160268.0	1942349.0	1723560.0	1626889.0	1852685.0	1490513.0	1144825.0	746775.0	465102.0	380751.0	341468.0	372752.01	376681.0	274738.0	184498.0	100254.0	104476.0	148874.0	137909.0	180494.0	188378.0	161543.99	160969.36	136742.42	153108.15	127234.05	229700.84	246324.14	:	:	:	:
RW,TOTAL,EXP,THS_NAC,PL	1354991.92	1351043.35	774011.29	719632.0	736793.54	810562.61	883742.87	683735.66	507675.61	474832.95	258262.41	134133.97	140806.74	163264.0	150888.0	248093.0	244113.0	160752.0	85072.0	102660.0	114733.0	87348.0	66256.0	54540.0	52998.0	134731.31	50050.12	61322.4	:	:	:	:
RW,TOTAL,EXP,THS_NAC,PT	45868.34	42242.0	30582.21	29764.0	25871.83	76656.02	102086.35	82244.08	90364.78	71578.9	42250.35	109466.13	92277.0	78486.0	69280.0	55313.0	56857.0	45531.0	47779.0	30476.1	29469.0	29879.83	5424.23	4772.38	4893.86	5717.96	4520.45	7534.31	:	:	:	:
RW,TOTAL,EXP,THS_NAC,RO	97750.15	84872.81	107203.01	62062.0	130217.27	206059.63	295467.76	193352.82	258069.18	129139.7	63066.24	84555.71	60656.0	48905.96	50600.49	70992.0	61274.29	26219.54	44675.17	105292.62	70734.81	9199.54	86.73	0.0	0.0	0.0	0.76	1.66	:	:	:	:
RW,TOTAL,EXP,THS_NAC,SE	1030457.0	993760.0	1097788.0	410427.0	417970.0	469307.0	495832.0	688648.0	601110.0	810526.0	741833.0	1489655.0	2135000.0	1267120.0	1319924.0	712247.0	680837.0	787418.0	548710.0	559112.0	573750.0	663300.98	850839.78	904600.47	1033082.96	498189.32	315999.47	284336.85	:	:	:	:
RW,TOTAL,EXP,THS_NAC,SI	153026.36	211631.71	196054.75	202173.0	165906.04	149727.44	112331.76	91048.66	81795.73	57116.93	43927.33	45793.53	46419.01	34975.35	26497.33	15576.49	15764.32	15207.63	12565.43	11371.79	10747.37	10652.44	4052.88	3384.82	2906.61	4890.3	3396.63	3721.55	:	:	:	:
RW,TOTAL,EXP,THS_NAC,SK	142405.71	143329.6	127786.94	131325.0	144934.52	163694.67	156942.65	203233.44	158800.73	187448.02	111740.94	109029.49	94880.72	85778.76	98878.08	63883.02	72912.53	74729.86	95989.35	87031.78	73275.13	37639.71	41793.43	23153.26	19868.58	22376.27	12662.01	0.0	:	:	:	:
RW,TOTAL,EXP,THS_NAC,UK	21570.89	21865.04	22463.12	18158.0	26904.87	31653.45	42748.16	37567.78	32672.67	25622.41	14091.14	30790.12	32675.88	26799.59	26255.4	22022.28	14566.28	9345.1	9115.64	15327.47	11662.6	13039.27	3206.89	3311.19	3016.26	2332.08	1386.85	2465.41	:	:	:	:
