country,country_code
Andorra,AND
Albania,ALB
Austria,AUT
Bosnia and Herzegovina,BIH
Belgium,BEL
Bulgaria,BGR
Belarus,BLR
Belarus,BYS
Switzerland,CHE
Czechoslovakia,CSK
Serbia and Montenegro,SCG
Cyprus,CYP
Czech Republic,CZE
German Democratic Republic,DDR
Denmark,DNK
Estonia,EST
Greece,GRC
Spain,ESP
Finland,FIN
Faroes,FRO
France,FRA
Guernsey,GGY
Gibraltar,GIB
Greenland,GRL
Croatia,HRV
Hungary,HUN
Ireland,IRL
Isle of Man,IMN
Iceland,ISL
Italy,ITA
Jersey,JEY
Liechtenstein,LIE
Lithuania,LTU
Luxembourg,LUX
Latvia,LVA
Monaco,MCO
Moldova,MDA
Montenegro,MNE
Former Yugoslav Republic of Macedonia,MKD
Malta,MLT
Netherlands,NLD
Norway,NOR
Poland,POL
Portugal,PRT
Romania,ROU
Serbia,SRB
Russia,RUS
Sweden,SWE
Slovenia,SVN
Slovakia,SVK
San Marino,SMR
Soviet Union,SUN
Türkiye,TUR
Ukraine,UKR
United Kingdom,GBR
Holy See,VAT
Yugoslavia,YUG
Yugoslavia,YUG
Yugoslavia,YUG
Czechoslovakia,CSK
Czechoslovakia,CSK
Poland,POL
Bulgaria,BGR
Germany,DEU
Greece,GRC
Hungary,HUN
Spain,ESP
Malta,MLT
Åland Islands,ALA
Algeria,DZA
American Samoa,ASM
Angola,AGO
Anguilla,AIA
Antarctica,ATA
Antigua and Barbuda,ATG
Argentina,ARG
Armenia,ARM
Aruba,ABW
Australia,AUS
Azerbaijan,AZE
Bahamas,BHS
Bahrain,BHR
Bangladesh,BGD
Barbados,BRB
Belize,BLZ
Benin,BEN
Bermuda,BMU
Bhutan,BTN
Bolivia,BOL
Botswana,BWA
Bouvet Island,BVT
Brazil,BRA
British Indian Ocean Territory,IOT
British Virgin Islands,VGB
Brunei,BRN
Burkina Faso,BFA
Burundi,BDI
Cambodia,KHM
Cameroon,CMR
Canada,CAN
Cabo Verde,CPV
Cayman Islands,CYM
Central African Republic,CAF
Chad,TCD
Chile,CHL
China,CHN
Christmas Island,CXR
Clipperton,CPT
Cocos (Keeling) Islands,CCK
Colombia,COL
Comoros,COM
Congo,COG
Cook Islands,COK
Costa Rica,CRI
Côte d’Ivoire,CIV
Cuba,CUB
Democratic Republic of the Congo,COD
Djibouti,DJI
Dominica,DMA
Dominican Republic,DOM
Timor-Leste,TLS
Ecuador,ECU
Egypt,EGY
El Salvador,SLV
Equatorial Guinea,GNQ
Eritrea,ERI
Ethiopia,ETH
Falkland Islands,FLK
Fiji,FJI
French Guiana,GUF
French Polynesia,PYF
French Southern and Antarctic Lands,ATF
Gabon,GAB
The Gambia,GMB
Georgia,GEO
Ghana,GHA
Grenada,GRD
Guadeloupe,GLP
Guam,GUM
Guatemala,GTM
Guinea,GIN
Guinea-Bissau,GNB
Guyana,GUY
Haiti,HTI
Heard Island and McDonald Islands,HMD
Honduras,HND
Hong Kong,HKG
India,IND
Indonesia,IDN
Iran,IRN
Iraq,IRQ
Israel,ISR
Jamaica,JAM
Japan,JPN
Jordan,JOR
Kazakhstan,KAZ
Kenya,KEN
Kiribati,KIR
Kuwait,KWT
Kyrgyzstan,KGZ
Laos,LAO
Lebanon,LBN
Lesotho,LSO
Liberia,LBR
Libya,LBY
Macao,MAC
Madagascar,MDG
Malawi,MWI
Malaysia,MYS
Maldives,MDV
Mali,MLI
Marshall Islands,MHL
Martinique,MTQ
Mauritania,MRT
Mauritius,MUS
Mayotte,MYT
Mexico,MEX
Micronesia,FSM
Mongolia,MNG
Montserrat,MSR
Morocco,MAR
Mozambique,MOZ
Myanmar,MMR
Namibia,NAM
Nauru,NRU
Nepal,NPL
Netherlands Antilles,ANT
New Caledonia,NCL
New Zealand,NZL
Nicaragua,NIC
Niger,NER
Nigeria,NGA
Niue,NIU
Norfolk Island,NFK
North Korea,PRK
Northern Mariana Islands,MNP
Oman,OMN
Pakistan,PAK
Palau,PLW
Palestine*,PSE
Panama,PAN
Papua New Guinea,PNG
Paraguay,PRY
Peru,PER
Philippines,PHL
Pitcairn Islands,PCN
Puerto Rico,PRI
Qatar,QAT
Réunion,REU
Rwanda,RWA
Saint Barthélemy,BLM
Saint Helena,SHN
Saint Kitts and Nevis,KNA
Saint Lucia,LCA
Saint Martin,MAF
Saint Pierre and Miquelon,SPM
Saint Vincent and the Grenadines,VCT
Samoa,WSM
São Tomé and Príncipe,STP
Saudi Arabia,SAU
Senegal,SEN
Seychelles,SYC
Sierra Leone,SLE
Singapore,SGP
Solomon Islands,SLB
Somalia,SOM
South Africa,ZAF
South Georgia and the South Sandwich Islands,SGS
South Korea,KOR
Sri Lanka,LKA
Sudan,SDN
Suriname,SUR
Svalbard and Jan Mayen,SJM
Swaziland,SWZ
Syria,SYR
Taiwan,TWN
Tajikistan,TJK
Tanzania,TZA
Thailand,THA
Togo,TGO
Tokelau,TKL
Tonga,TON
Trinidad and Tobago,TTO
Tunisia,TUN
Turkmenistan,TKM
Turks and Caicos Islands,TCA
Tuvalu,TUV
Uganda,UGA
United Arab Emirates,ARE
United States,USA
United States Minor Outlying Islands,UMI
Uruguay,URY
US Virgin Islands,VIR
Uzbekistan,UZB
Vanuatu,VUT
Venezuela,VEN
Vietnam,VNM
Wallis and Futuna,WLF
Western Sahara,ESH
Yemen,YEM
Zambia,ZMB
Zimbabwe,ZWE
Afghanistan,AFG
Burma,BUR
Upper Volta,HVO
South Yemen,YEM
French Afar and Issas,AFI
British Antarctic Territory,ATB
Canton and Enderbury Islands,CTE
Dahomey,DHY
Dronning Maud Land,ATN
East Timor,TMP
Metropolitan France,FXX
Gilbert and Ellice Islands,GEL
Johnston Island,JTN
Midway Islands,MID
Neutral Zone,NTZ
New Hebrides,NHB
Trust Territory of the Pacific Islands,PCI
Panama Canal Zone,PCZ
Sikkim,SKM
Southern Rhodesia,RHO
US Miscellaneous Pacific Islands,PUS
Democratic Republic of Vietnam,VDR
Wake Island,WAK
North Yemen,YMD
Nepal,NPL
"Saint Helena, Ascension and Tristan da Cunha",SHN
"Bonaire, Sint Eustatius and Saba",BES
Curaçao,CUW
Sint Maarten,SXM
Romania,ROU
Romania,ROU
Libya,LBY
Vietnam,VNM
Hungary,HUN
South Sudan,SSD
Burma/Myanmar,MMR
New Caledonia,NCL
Ethiopia,ETH
Macao,MAC
Nepal,NPL
Mayotte,MYT
Myanmar/Burma,MMR
Somalia,SOM
Germany,DEU
Libya,LBY
Wallis and Futuna,WLF
Czechia,CZE
Eswatini,SWZ
North Macedonia,MKD
Zaire,ZAR
Sark,CRQ
