<svg width="51" height="50" viewBox="0 0 51 50" fill="none" xmlns="http://www.w3.org/2000/svg">
<circle cx="25.7246" cy="25" r="25" fill="#004494"/>
<path d="M32.0485 36H27.4812V33.5474C27.4812 33.3223 27.4375 33.0996 27.353 32.8926C27.2684 32.6856 27.1447 32.4986 26.9892 32.3429C26.5665 31.9262 26.003 31.7018 25.4222 31.7189C24.8859 31.7225 24.3682 31.925 23.9614 32.2903V32.2903C23.7797 32.4517 23.6337 32.6524 23.5335 32.8785C23.4332 33.1046 23.3811 33.3508 23.3808 33.6V36H18.8506C18.0962 35.9991 17.3728 35.686 16.8386 35.1292C16.3044 34.5724 16.0029 33.8171 16 33.0286V28.288H18.3433C18.5843 28.2838 18.8222 28.2295 19.0429 28.1283C19.2637 28.027 19.463 27.8809 19.6292 27.6983C20.0304 27.2765 20.2553 26.7056 20.2546 26.1109V26.0937C20.2491 25.5494 20.0432 25.0283 19.6798 24.6384C19.3163 24.2486 18.8232 24.0199 18.3028 24H16V19.2C16.0001 18.8126 16.0752 18.4291 16.2209 18.0729C16.3665 17.7166 16.5796 17.3948 16.8474 17.1269V17.1269C17.3806 16.5879 18.0936 16.287 18.8353 16.288H22.0938V15.5109C22.0938 14.5797 22.4477 13.6867 23.0776 13.0283C23.7076 12.3699 24.562 12 25.4529 12H25.513C26.3979 12.0251 27.2383 12.4109 27.8545 13.0751C28.4708 13.7393 28.814 14.6291 28.8108 15.5543V16.2869H32.0813C32.4471 16.2869 32.8093 16.3622 33.1471 16.5087C33.485 16.6552 33.7919 16.8699 34.0503 17.1404C34.3086 17.411 34.5134 17.7322 34.6529 18.0856C34.7924 18.439 34.8638 18.8177 34.8631 19.2V22.6137H35.5629C36.0087 22.6029 36.452 22.6849 36.8671 22.8551C37.2823 23.0252 37.6608 23.28 37.9808 23.6046C38.3007 23.9293 38.5556 24.3172 38.7305 24.7459C38.9055 25.1745 38.9971 25.6353 38.9999 26.1013C39.0028 26.5674 38.9168 27.0293 38.747 27.4603C38.5773 27.8912 38.3271 28.2825 38.0112 28.6114C37.6952 28.9402 37.3198 29.2 36.9068 29.3757C36.4937 29.5513 36.0514 29.6392 35.6055 29.6343H34.8631V33.0217C34.8671 33.8062 34.5733 34.5603 34.0461 35.1187C33.5189 35.677 32.8013 35.994 32.0507 36H32.0485Z" fill="white"/>
</svg>
