<svg width="416" height="293" viewBox="0 0 416 293" fill="none" xmlns="http://www.w3.org/2000/svg">
<g clip-path="url(#clip0_5651_196554)">
<path d="M229.05 142.357L229.05 142.357L229.049 142.365C228.359 151.596 221.323 158.996 213.498 158.996C205.673 158.996 198.626 151.593 197.956 142.344L197.956 142.344L197.955 142.334C197.754 140.154 198.009 137.956 198.703 135.88C199.396 133.805 200.512 131.897 201.982 130.277C203.458 128.716 205.243 127.479 207.223 126.645C209.205 125.811 211.339 125.398 213.489 125.434L213.498 124.934L213.505 125.434C215.655 125.402 217.789 125.819 219.768 126.658C221.747 127.497 223.529 128.74 225 130.306C226.475 131.923 227.597 133.829 228.294 135.904C228.992 137.979 229.249 140.177 229.05 142.357ZM222.118 132.996L222.118 132.996L222.11 132.987C221.005 131.821 219.67 130.898 218.189 130.276C216.712 129.655 215.121 129.348 213.519 129.375C211.913 129.341 210.317 129.64 208.833 130.255C207.346 130.871 206.004 131.789 204.891 132.952L204.885 132.958L204.88 132.964C203.774 134.195 202.936 135.643 202.42 137.216C201.905 138.787 201.722 140.448 201.883 142.093C202.14 145.591 203.581 148.819 205.677 151.178C207.773 153.537 210.556 155.059 213.498 155.059C216.435 155.059 219.215 153.536 221.311 151.175C223.408 148.813 224.851 145.581 225.112 142.077C225.27 140.439 225.085 138.787 224.571 137.224C224.055 135.66 223.22 134.22 222.118 132.996Z" fill="#1A3358" stroke="#1A3358"/>
<path d="M233.462 170.723L233.463 170.724C236.467 172.646 239.043 175.167 241.027 178.13C243.012 181.093 244.364 184.433 244.999 187.943L244.999 187.943L245 187.951C245.142 188.664 245.125 189.399 244.951 190.104C244.777 190.808 244.451 191.465 243.995 192.03C243.587 192.517 243.076 192.907 242.499 193.172C241.92 193.438 241.289 193.571 240.653 193.562L240.653 193.562H240.645H186.333V193.562L186.327 193.562C185.692 193.569 185.064 193.436 184.487 193.17C183.912 192.905 183.403 192.515 182.996 192.03C182.541 191.465 182.215 190.808 182.041 190.104C181.867 189.399 181.85 188.664 181.991 187.951L181.991 187.951L181.993 187.943C182.626 184.434 183.976 181.094 185.958 178.132C187.941 175.169 190.514 172.647 193.515 170.724L193.516 170.723C199.469 166.887 206.413 164.875 213.495 164.937L213.499 164.437L213.503 164.937C220.578 164.88 227.515 166.891 233.462 170.723ZM240.626 189.624H241.016L241.111 189.246C241.162 189.043 241.163 188.83 241.115 188.625C240.567 185.642 239.41 182.803 237.717 180.286C236.021 177.765 233.822 175.622 231.26 173.989C225.964 170.592 219.791 168.814 213.499 168.874C207.203 168.811 201.025 170.589 195.725 173.989C193.162 175.622 190.965 177.766 189.269 180.286C187.575 182.803 186.418 185.642 185.87 188.625C185.822 188.829 185.823 189.042 185.874 189.246L185.969 189.624H186.359H240.626Z" fill="#1A3358" stroke="#1A3358"/>
</g>
<rect x="132" y="9" width="162" height="38" rx="1" stroke="#EFC848" stroke-width="2"/>
<path d="M146.883 33.2568C147.573 33.2568 148.141 33.1851 148.585 33.0415C149.378 32.7749 150.027 32.2622 150.533 31.5034C150.937 30.895 151.227 30.1157 151.405 29.1655C151.507 28.5981 151.559 28.0718 151.559 27.5864C151.559 25.7202 151.186 24.271 150.441 23.2388C149.703 22.2065 148.51 21.6904 146.862 21.6904H143.243V33.2568H146.883ZM141.192 19.937H147.293C149.364 19.937 150.971 20.6719 152.112 22.1416C153.131 23.4678 153.64 25.1665 153.64 27.2378C153.64 28.8374 153.339 30.2832 152.738 31.5752C151.678 33.8584 149.856 35 147.272 35H141.192V19.937ZM160.387 33.8105C161.611 33.8105 162.448 33.3491 162.899 32.4263C163.357 31.4966 163.586 30.4644 163.586 29.3296C163.586 28.3042 163.422 27.4702 163.094 26.8276C162.575 25.8159 161.679 25.3101 160.408 25.3101C159.28 25.3101 158.459 25.7407 157.947 26.6021C157.434 27.4634 157.178 28.5024 157.178 29.7192C157.178 30.8882 157.434 31.8623 157.947 32.6416C158.459 33.4209 159.273 33.8105 160.387 33.8105ZM160.459 23.7002C161.874 23.7002 163.07 24.1719 164.048 25.1152C165.025 26.0586 165.514 27.4463 165.514 29.2783C165.514 31.0488 165.083 32.5117 164.222 33.667C163.361 34.8223 162.024 35.3999 160.213 35.3999C158.702 35.3999 157.502 34.8906 156.614 33.8721C155.725 32.8467 155.281 31.4727 155.281 29.75C155.281 27.9043 155.749 26.4346 156.686 25.3408C157.622 24.2471 158.88 23.7002 160.459 23.7002ZM167.719 24.0693H169.595V35H167.719V24.0693ZM167.719 19.937H169.595V22.0288H167.719V19.937ZM172.395 24.0181H174.148V25.5767C174.667 24.9341 175.218 24.4727 175.799 24.1924C176.38 23.9121 177.026 23.772 177.737 23.772C179.295 23.772 180.348 24.3154 180.895 25.4023C181.196 25.9971 181.346 26.8481 181.346 27.9556V35H179.47V28.0786C179.47 27.4087 179.371 26.8687 179.172 26.4585C178.844 25.7749 178.25 25.4331 177.388 25.4331C176.951 25.4331 176.592 25.4775 176.312 25.5664C175.806 25.7168 175.361 26.0176 174.979 26.4688C174.671 26.8311 174.469 27.207 174.374 27.5967C174.285 27.9795 174.24 28.5298 174.24 29.2476V35H172.395V24.0181ZM187.96 23.8232C188.821 23.8232 189.573 24.0352 190.216 24.459C190.564 24.6982 190.92 25.0469 191.282 25.5049V24.1206H192.984V34.1079C192.984 35.5024 192.779 36.603 192.369 37.4097C191.604 38.8999 190.158 39.645 188.032 39.645C186.849 39.645 185.854 39.3784 185.048 38.8452C184.241 38.3188 183.79 37.4917 183.694 36.3638H185.571C185.66 36.856 185.837 37.2354 186.104 37.502C186.521 37.9121 187.177 38.1172 188.073 38.1172C189.488 38.1172 190.414 37.6182 190.852 36.6201C191.111 36.0322 191.231 34.9829 191.21 33.4722C190.841 34.0327 190.397 34.4497 189.877 34.7231C189.358 34.9966 188.671 35.1333 187.816 35.1333C186.627 35.1333 185.584 34.7129 184.689 33.8721C183.8 33.0244 183.356 31.6265 183.356 29.6782C183.356 27.8394 183.804 26.4038 184.699 25.3716C185.602 24.3394 186.688 23.8232 187.96 23.8232ZM191.282 29.4629C191.282 28.1025 191.002 27.0942 190.441 26.438C189.881 25.7817 189.167 25.4536 188.298 25.4536C187 25.4536 186.111 26.062 185.632 27.2788C185.379 27.9282 185.253 28.7793 185.253 29.832C185.253 31.0693 185.502 32.0127 186.001 32.6621C186.507 33.3047 187.184 33.626 188.032 33.626C189.358 33.626 190.291 33.0278 190.831 31.8315C191.132 31.1548 191.282 30.3652 191.282 29.4629ZM207.524 26.3047C208.386 26.3047 209.056 26.1851 209.534 25.9458C210.286 25.5698 210.662 24.8931 210.662 23.9155C210.662 22.9312 210.262 22.2681 209.462 21.9263C209.011 21.7349 208.341 21.6392 207.453 21.6392H203.812V26.3047H207.524ZM208.211 33.2568C209.462 33.2568 210.354 32.8945 210.888 32.1699C211.223 31.7119 211.39 31.1582 211.39 30.5088C211.39 29.415 210.901 28.6699 209.924 28.2734C209.404 28.0615 208.717 27.9556 207.863 27.9556H203.812V33.2568H208.211ZM201.813 19.937H208.283C210.047 19.937 211.301 20.4634 212.046 21.5161C212.484 22.1382 212.703 22.856 212.703 23.6694C212.703 24.6196 212.433 25.3989 211.893 26.0073C211.612 26.3286 211.209 26.6226 210.683 26.8892C211.455 27.1831 212.033 27.5146 212.416 27.8838C213.092 28.54 213.431 29.4458 213.431 30.6011C213.431 31.5718 213.126 32.4502 212.518 33.2363C211.609 34.4121 210.163 35 208.181 35H201.813V19.937ZM217.471 24.0181V31.3086C217.471 31.8691 217.56 32.3271 217.737 32.6826C218.065 33.3389 218.677 33.667 219.573 33.667C220.858 33.667 221.733 33.0928 222.198 31.9443C222.451 31.3291 222.577 30.4849 222.577 29.4116V24.0181H224.423V35H222.68L222.7 33.3799C222.461 33.7969 222.164 34.1489 221.808 34.436C221.104 35.0103 220.25 35.2974 219.245 35.2974C217.679 35.2974 216.613 34.7744 216.045 33.7285C215.738 33.168 215.584 32.4194 215.584 31.4829V24.0181H217.471ZM228.412 31.5547C228.466 32.1699 228.62 32.6416 228.873 32.9697C229.338 33.5645 230.145 33.8618 231.293 33.8618C231.977 33.8618 232.578 33.7148 233.098 33.4209C233.617 33.1201 233.877 32.6587 233.877 32.0366C233.877 31.5649 233.668 31.2061 233.251 30.96C232.985 30.8096 232.458 30.6353 231.672 30.437L230.206 30.0679C229.27 29.8354 228.579 29.5757 228.135 29.2886C227.342 28.7896 226.945 28.0991 226.945 27.2173C226.945 26.1782 227.318 25.3374 228.063 24.6948C228.815 24.0522 229.823 23.731 231.088 23.731C232.742 23.731 233.935 24.2163 234.667 25.187C235.125 25.8022 235.347 26.4653 235.333 27.1763H233.59C233.556 26.7593 233.409 26.3799 233.149 26.0381C232.725 25.5527 231.99 25.3101 230.944 25.3101C230.247 25.3101 229.717 25.4434 229.355 25.71C229 25.9766 228.822 26.3286 228.822 26.7661C228.822 27.2446 229.058 27.6274 229.529 27.9146C229.803 28.0854 230.206 28.2358 230.739 28.3657L231.959 28.6631C233.286 28.9844 234.174 29.2954 234.625 29.5962C235.343 30.0679 235.702 30.8096 235.702 31.8213C235.702 32.7988 235.33 33.6431 234.584 34.354C233.846 35.0649 232.718 35.4204 231.201 35.4204C229.567 35.4204 228.408 35.0513 227.725 34.313C227.048 33.5679 226.686 32.6484 226.638 31.5547H228.412ZM237.814 24.0693H239.691V35H237.814V24.0693ZM237.814 19.937H239.691V22.0288H237.814V19.937ZM242.49 24.0181H244.244V25.5767C244.763 24.9341 245.313 24.4727 245.895 24.1924C246.476 23.9121 247.122 23.772 247.833 23.772C249.391 23.772 250.444 24.3154 250.991 25.4023C251.292 25.9971 251.442 26.8481 251.442 27.9556V35H249.565V28.0786C249.565 27.4087 249.466 26.8687 249.268 26.4585C248.94 25.7749 248.345 25.4331 247.484 25.4331C247.046 25.4331 246.688 25.4775 246.407 25.5664C245.901 25.7168 245.457 26.0176 245.074 26.4688C244.767 26.8311 244.565 27.207 244.469 27.5967C244.38 27.9795 244.336 28.5298 244.336 29.2476V35H242.49V24.0181ZM258.753 23.772C259.532 23.772 260.288 23.9565 261.019 24.3257C261.75 24.688 262.308 25.1597 262.69 25.7407C263.06 26.2944 263.306 26.9404 263.429 27.6787C263.538 28.1846 263.593 28.9912 263.593 30.0986H255.543C255.578 31.2129 255.841 32.1084 256.333 32.7852C256.825 33.4551 257.587 33.79 258.62 33.79C259.583 33.79 260.353 33.4722 260.927 32.8364C261.255 32.4673 261.487 32.04 261.624 31.5547H263.439C263.391 31.958 263.23 32.4092 262.957 32.9082C262.69 33.4004 262.39 33.8037 262.055 34.1182C261.494 34.665 260.8 35.0342 259.973 35.2256C259.529 35.335 259.026 35.3896 258.466 35.3896C257.099 35.3896 255.94 34.894 254.99 33.9028C254.04 32.9048 253.564 31.5103 253.564 29.7192C253.564 27.9556 254.043 26.5234 255 25.4229C255.957 24.3223 257.208 23.772 258.753 23.772ZM261.696 28.6323C261.621 27.8325 261.446 27.1934 261.173 26.7148C260.667 25.8262 259.823 25.3818 258.64 25.3818C257.792 25.3818 257.082 25.6895 256.507 26.3047C255.933 26.9131 255.629 27.689 255.595 28.6323H261.696ZM266.966 31.5547C267.021 32.1699 267.175 32.6416 267.428 32.9697C267.893 33.5645 268.699 33.8618 269.848 33.8618C270.531 33.8618 271.133 33.7148 271.652 33.4209C272.172 33.1201 272.432 32.6587 272.432 32.0366C272.432 31.5649 272.223 31.2061 271.806 30.96C271.54 30.8096 271.013 30.6353 270.227 30.437L268.761 30.0679C267.824 29.8354 267.134 29.5757 266.689 29.2886C265.896 28.7896 265.5 28.0991 265.5 27.2173C265.5 26.1782 265.873 25.3374 266.618 24.6948C267.37 24.0522 268.378 23.731 269.643 23.731C271.297 23.731 272.49 24.2163 273.221 25.187C273.679 25.8022 273.901 26.4653 273.888 27.1763H272.145C272.11 26.7593 271.963 26.3799 271.704 26.0381C271.28 25.5527 270.545 25.3101 269.499 25.3101C268.802 25.3101 268.272 25.4434 267.91 25.71C267.554 25.9766 267.376 26.3286 267.376 26.7661C267.376 27.2446 267.612 27.6274 268.084 27.9146C268.357 28.0854 268.761 28.2358 269.294 28.3657L270.514 28.6631C271.84 28.9844 272.729 29.2954 273.18 29.5962C273.898 30.0679 274.257 30.8096 274.257 31.8213C274.257 32.7988 273.884 33.6431 273.139 34.354C272.401 35.0649 271.273 35.4204 269.755 35.4204C268.122 35.4204 266.963 35.0513 266.279 34.313C265.603 33.5679 265.24 32.6484 265.192 31.5547H266.966ZM277.466 31.5547C277.521 32.1699 277.675 32.6416 277.928 32.9697C278.393 33.5645 279.199 33.8618 280.348 33.8618C281.031 33.8618 281.633 33.7148 282.152 33.4209C282.672 33.1201 282.932 32.6587 282.932 32.0366C282.932 31.5649 282.723 31.2061 282.306 30.96C282.04 30.8096 281.513 30.6353 280.727 30.437L279.261 30.0679C278.324 29.8354 277.634 29.5757 277.189 29.2886C276.396 28.7896 276 28.0991 276 27.2173C276 26.1782 276.373 25.3374 277.118 24.6948C277.87 24.0522 278.878 23.731 280.143 23.731C281.797 23.731 282.99 24.2163 283.721 25.187C284.179 25.8022 284.401 26.4653 284.388 27.1763H282.645C282.61 26.7593 282.463 26.3799 282.204 26.0381C281.78 25.5527 281.045 25.3101 279.999 25.3101C279.302 25.3101 278.772 25.4434 278.41 25.71C278.054 25.9766 277.876 26.3286 277.876 26.7661C277.876 27.2446 278.112 27.6274 278.584 27.9146C278.857 28.0854 279.261 28.2358 279.794 28.3657L281.014 28.6631C282.34 28.9844 283.229 29.2954 283.68 29.5962C284.398 30.0679 284.757 30.8096 284.757 31.8213C284.757 32.7988 284.384 33.6431 283.639 34.354C282.901 35.0649 281.773 35.4204 280.255 35.4204C278.622 35.4204 277.463 35.0513 276.779 34.313C276.103 33.5679 275.74 32.6484 275.692 31.5547H277.466Z" fill="#273F62"/>
<rect x="308" y="86" width="100" height="38" rx="1" stroke="#EFC848" stroke-width="2"/>
<path d="M319.933 107.14C319.98 107.994 320.182 108.688 320.538 109.221C321.214 110.219 322.407 110.718 324.116 110.718C324.882 110.718 325.579 110.609 326.208 110.39C327.425 109.966 328.033 109.208 328.033 108.114C328.033 107.293 327.777 106.709 327.264 106.36C326.745 106.019 325.931 105.721 324.824 105.468L322.783 105.007C321.45 104.706 320.507 104.375 319.953 104.012C318.996 103.383 318.518 102.443 318.518 101.192C318.518 99.8389 318.986 98.728 319.922 97.8599C320.859 96.9917 322.185 96.5576 323.901 96.5576C325.48 96.5576 326.82 96.9404 327.92 97.7061C329.028 98.4648 329.582 99.6816 329.582 101.356H327.664C327.562 100.55 327.343 99.9312 327.008 99.5005C326.386 98.7144 325.33 98.3213 323.839 98.3213C322.636 98.3213 321.771 98.5742 321.245 99.0801C320.719 99.5859 320.456 100.174 320.456 100.844C320.456 101.582 320.763 102.122 321.378 102.464C321.782 102.683 322.694 102.956 324.116 103.284L326.229 103.766C327.247 103.999 328.033 104.316 328.587 104.72C329.544 105.424 330.022 106.446 330.022 107.786C330.022 109.454 329.414 110.646 328.197 111.364C326.987 112.082 325.579 112.441 323.973 112.441C322.1 112.441 320.633 111.962 319.574 111.005C318.514 110.055 317.995 108.767 318.015 107.14H319.933ZM332.729 97.9521H334.596V101.018H336.349V102.525H334.596V109.693C334.596 110.076 334.726 110.332 334.985 110.462C335.129 110.537 335.368 110.575 335.703 110.575C335.792 110.575 335.888 110.575 335.99 110.575C336.093 110.568 336.212 110.558 336.349 110.544V112C336.137 112.062 335.915 112.106 335.683 112.133C335.457 112.161 335.211 112.174 334.944 112.174C334.083 112.174 333.499 111.956 333.191 111.518C332.883 111.074 332.729 110.5 332.729 109.795V102.525H331.243V101.018H332.729V97.9521ZM340.051 101.018V108.309C340.051 108.869 340.14 109.327 340.317 109.683C340.646 110.339 341.257 110.667 342.153 110.667C343.438 110.667 344.313 110.093 344.778 108.944C345.031 108.329 345.157 107.485 345.157 106.412V101.018H347.003V112H345.26L345.28 110.38C345.041 110.797 344.744 111.149 344.388 111.436C343.684 112.01 342.83 112.297 341.825 112.297C340.259 112.297 339.193 111.774 338.625 110.729C338.318 110.168 338.164 109.419 338.164 108.483V101.018H340.051ZM351.063 106.637C351.063 107.813 351.313 108.797 351.812 109.59C352.311 110.383 353.111 110.78 354.211 110.78C355.066 110.78 355.767 110.414 356.313 109.683C356.867 108.944 357.144 107.888 357.144 106.514C357.144 105.126 356.86 104.101 356.293 103.438C355.726 102.768 355.025 102.433 354.191 102.433C353.261 102.433 352.506 102.789 351.925 103.5C351.351 104.21 351.063 105.256 351.063 106.637ZM353.842 100.823C354.683 100.823 355.387 101.001 355.955 101.356C356.283 101.562 356.655 101.92 357.072 102.433V96.8857H358.846V112H357.185V110.472C356.754 111.149 356.245 111.638 355.657 111.938C355.069 112.239 354.396 112.39 353.637 112.39C352.414 112.39 351.354 111.877 350.458 110.852C349.563 109.819 349.115 108.449 349.115 106.74C349.115 105.14 349.522 103.756 350.335 102.587C351.156 101.411 352.325 100.823 353.842 100.823ZM368.444 101.018H370.484C370.225 101.722 369.647 103.329 368.751 105.837C368.082 107.724 367.521 109.262 367.07 110.452C366.003 113.254 365.251 114.963 364.814 115.579C364.376 116.194 363.625 116.501 362.558 116.501C362.298 116.501 362.097 116.491 361.953 116.471C361.816 116.45 361.646 116.413 361.44 116.358V114.676C361.762 114.765 361.994 114.82 362.138 114.84C362.281 114.861 362.408 114.871 362.517 114.871C362.859 114.871 363.108 114.813 363.266 114.697C363.43 114.587 363.566 114.451 363.676 114.287C363.71 114.232 363.833 113.952 364.045 113.446C364.257 112.94 364.411 112.564 364.506 112.318L360.446 101.018H362.538L365.48 109.959L368.444 101.018ZM372.084 101.069H373.96V112H372.084V101.069ZM372.084 96.937H373.96V99.0288H372.084V96.937ZM376.76 101.018H378.513V102.577C379.033 101.934 379.583 101.473 380.164 101.192C380.745 100.912 381.391 100.772 382.102 100.772C383.661 100.772 384.713 101.315 385.26 102.402C385.561 102.997 385.711 103.848 385.711 104.956V112H383.835V105.079C383.835 104.409 383.736 103.869 383.538 103.458C383.209 102.775 382.615 102.433 381.753 102.433C381.316 102.433 380.957 102.478 380.677 102.566C380.171 102.717 379.727 103.018 379.344 103.469C379.036 103.831 378.834 104.207 378.739 104.597C378.65 104.979 378.605 105.53 378.605 106.248V112H376.76V101.018ZM392.325 100.823C393.187 100.823 393.938 101.035 394.581 101.459C394.93 101.698 395.285 102.047 395.647 102.505V101.121H397.35V111.108C397.35 112.502 397.145 113.603 396.734 114.41C395.969 115.9 394.523 116.645 392.397 116.645C391.214 116.645 390.22 116.378 389.413 115.845C388.606 115.319 388.155 114.492 388.06 113.364H389.936C390.025 113.856 390.203 114.235 390.469 114.502C390.886 114.912 391.542 115.117 392.438 115.117C393.853 115.117 394.779 114.618 395.217 113.62C395.477 113.032 395.596 111.983 395.576 110.472C395.207 111.033 394.762 111.45 394.243 111.723C393.723 111.997 393.036 112.133 392.182 112.133C390.992 112.133 389.95 111.713 389.054 110.872C388.166 110.024 387.721 108.626 387.721 106.678C387.721 104.839 388.169 103.404 389.064 102.372C389.967 101.339 391.054 100.823 392.325 100.823ZM395.647 106.463C395.647 105.103 395.367 104.094 394.807 103.438C394.246 102.782 393.532 102.454 392.664 102.454C391.365 102.454 390.476 103.062 389.998 104.279C389.745 104.928 389.618 105.779 389.618 106.832C389.618 108.069 389.868 109.013 390.367 109.662C390.873 110.305 391.549 110.626 392.397 110.626C393.723 110.626 394.656 110.028 395.196 108.832C395.497 108.155 395.647 107.365 395.647 106.463Z" fill="#273F62"/>
<rect x="285" y="248" width="90" height="36" rx="1" stroke="#EFC848" stroke-width="2"/>
<path d="M297.548 257.937H300.471L304.798 270.672L309.094 257.937H311.986V273H310.048V264.11C310.048 263.802 310.055 263.293 310.068 262.582C310.082 261.871 310.089 261.109 310.089 260.295L305.792 273H303.772L299.445 260.295V260.757C299.445 261.126 299.452 261.69 299.466 262.449C299.486 263.201 299.497 263.754 299.497 264.11V273H297.548V257.937ZM319.205 271.811C320.428 271.811 321.266 271.349 321.717 270.426C322.175 269.497 322.404 268.464 322.404 267.33C322.404 266.304 322.24 265.47 321.912 264.828C321.392 263.816 320.497 263.31 319.225 263.31C318.097 263.31 317.277 263.741 316.764 264.602C316.251 265.463 315.995 266.502 315.995 267.719C315.995 268.888 316.251 269.862 316.764 270.642C317.277 271.421 318.09 271.811 319.205 271.811ZM319.276 261.7C320.691 261.7 321.888 262.172 322.865 263.115C323.843 264.059 324.332 265.446 324.332 267.278C324.332 269.049 323.901 270.512 323.04 271.667C322.178 272.822 320.842 273.4 319.03 273.4C317.52 273.4 316.32 272.891 315.431 271.872C314.542 270.847 314.098 269.473 314.098 267.75C314.098 265.904 314.566 264.435 315.503 263.341C316.439 262.247 317.697 261.7 319.276 261.7ZM327.438 262.018L330.371 270.959L333.437 262.018H335.457L331.314 273H329.346L325.295 262.018H327.438ZM337.036 262.069H338.913V273H337.036V262.069ZM337.036 257.937H338.913V260.029H337.036V257.937ZM341.712 262.018H343.465V263.577C343.985 262.934 344.535 262.473 345.116 262.192C345.697 261.912 346.343 261.772 347.054 261.772C348.613 261.772 349.666 262.315 350.212 263.402C350.513 263.997 350.664 264.848 350.664 265.956V273H348.787V266.079C348.787 265.409 348.688 264.869 348.49 264.458C348.162 263.775 347.567 263.433 346.706 263.433C346.268 263.433 345.909 263.478 345.629 263.566C345.123 263.717 344.679 264.018 344.296 264.469C343.988 264.831 343.787 265.207 343.691 265.597C343.602 265.979 343.558 266.53 343.558 267.248V273H341.712V262.018ZM357.277 261.823C358.139 261.823 358.891 262.035 359.533 262.459C359.882 262.698 360.237 263.047 360.6 263.505V262.121H362.302V272.108C362.302 273.502 362.097 274.603 361.687 275.41C360.921 276.9 359.475 277.645 357.349 277.645C356.167 277.645 355.172 277.378 354.365 276.845C353.559 276.319 353.107 275.492 353.012 274.364H354.888C354.977 274.856 355.155 275.235 355.421 275.502C355.838 275.912 356.495 276.117 357.39 276.117C358.805 276.117 359.731 275.618 360.169 274.62C360.429 274.032 360.548 272.983 360.528 271.472C360.159 272.033 359.714 272.45 359.195 272.723C358.675 272.997 357.988 273.133 357.134 273.133C355.944 273.133 354.902 272.713 354.006 271.872C353.118 271.024 352.673 269.626 352.673 267.678C352.673 265.839 353.121 264.404 354.017 263.372C354.919 262.339 356.006 261.823 357.277 261.823ZM360.6 267.463C360.6 266.103 360.319 265.094 359.759 264.438C359.198 263.782 358.484 263.454 357.616 263.454C356.317 263.454 355.428 264.062 354.95 265.279C354.697 265.928 354.57 266.779 354.57 267.832C354.57 269.069 354.82 270.013 355.319 270.662C355.825 271.305 356.501 271.626 357.349 271.626C358.675 271.626 359.608 271.028 360.148 269.832C360.449 269.155 360.6 268.365 360.6 267.463Z" fill="#273F62"/>
<rect x="51" y="248" width="96" height="36" rx="1" stroke="#EFC848" stroke-width="2"/>
<path d="M63.0942 257.937L65.9346 270.19L69.3389 257.937H71.5537L74.958 270.19L77.7983 257.937H80.0337L76.0757 273H73.9326L70.4565 260.511L66.96 273H64.8169L60.8794 257.937H63.0942ZM85.6733 271.811C86.897 271.811 87.7344 271.349 88.1855 270.426C88.6436 269.497 88.8726 268.464 88.8726 267.33C88.8726 266.304 88.7085 265.47 88.3804 264.828C87.8608 263.816 86.9653 263.31 85.6938 263.31C84.5659 263.31 83.7456 263.741 83.2329 264.602C82.7202 265.463 82.4639 266.502 82.4639 267.719C82.4639 268.888 82.7202 269.862 83.2329 270.642C83.7456 271.421 84.5591 271.811 85.6733 271.811ZM85.7451 261.7C87.1602 261.7 88.3564 262.172 89.334 263.115C90.3115 264.059 90.8003 265.446 90.8003 267.278C90.8003 269.049 90.3696 270.512 89.5083 271.667C88.647 272.822 87.3105 273.4 85.499 273.4C83.9883 273.4 82.7886 272.891 81.8999 271.872C81.0112 270.847 80.5669 269.473 80.5669 267.75C80.5669 265.904 81.0352 264.435 81.9717 263.341C82.9082 262.247 84.166 261.7 85.7451 261.7ZM93.0562 262.018H94.8096V263.915C94.9531 263.546 95.3052 263.098 95.8657 262.572C96.4263 262.039 97.0723 261.772 97.8037 261.772C97.8379 261.772 97.896 261.775 97.978 261.782C98.0601 261.789 98.2002 261.803 98.3984 261.823V263.771C98.2891 263.751 98.1865 263.737 98.0908 263.73C98.002 263.724 97.9028 263.72 97.7935 263.72C96.8638 263.72 96.1494 264.021 95.6504 264.623C95.1514 265.217 94.9019 265.904 94.9019 266.684V273H93.0562V262.018ZM99.957 257.937H101.731V266.684L106.468 262.018H108.827L104.623 266.13L109.062 273H106.704L103.279 267.463L101.731 268.878V273H99.957V257.937ZM110.498 262.069H112.375V273H110.498V262.069ZM110.498 257.937H112.375V260.029H110.498V257.937ZM115.174 262.018H116.927V263.577C117.447 262.934 117.997 262.473 118.578 262.192C119.159 261.912 119.805 261.772 120.516 261.772C122.075 261.772 123.127 262.315 123.674 263.402C123.975 263.997 124.125 264.848 124.125 265.956V273H122.249V266.079C122.249 265.409 122.15 264.869 121.952 264.458C121.624 263.775 121.029 263.433 120.167 263.433C119.73 263.433 119.371 263.478 119.091 263.566C118.585 263.717 118.141 264.018 117.758 264.469C117.45 264.831 117.249 265.207 117.153 265.597C117.064 265.979 117.02 266.53 117.02 267.248V273H115.174V262.018ZM130.739 261.823C131.601 261.823 132.353 262.035 132.995 262.459C133.344 262.698 133.699 263.047 134.062 263.505V262.121H135.764V272.108C135.764 273.502 135.559 274.603 135.148 275.41C134.383 276.9 132.937 277.645 130.811 277.645C129.628 277.645 128.634 277.378 127.827 276.845C127.021 276.319 126.569 275.492 126.474 274.364H128.35C128.439 274.856 128.617 275.235 128.883 275.502C129.3 275.912 129.957 276.117 130.852 276.117C132.267 276.117 133.193 275.618 133.631 274.62C133.891 274.032 134.01 272.983 133.99 271.472C133.621 272.033 133.176 272.45 132.657 272.723C132.137 272.997 131.45 273.133 130.596 273.133C129.406 273.133 128.364 272.713 127.468 271.872C126.58 271.024 126.135 269.626 126.135 267.678C126.135 265.839 126.583 264.404 127.479 263.372C128.381 262.339 129.468 261.823 130.739 261.823ZM134.062 267.463C134.062 266.103 133.781 265.094 133.221 264.438C132.66 263.782 131.946 263.454 131.078 263.454C129.779 263.454 128.89 264.062 128.412 265.279C128.159 265.928 128.032 266.779 128.032 267.832C128.032 269.069 128.282 270.013 128.781 270.662C129.287 271.305 129.963 271.626 130.811 271.626C132.137 271.626 133.07 271.028 133.61 269.832C133.911 269.155 134.062 268.365 134.062 267.463Z" fill="#273F62"/>
<rect x="8" y="86" width="91" height="36" rx="1" stroke="#EFC848" stroke-width="2"/>
<path d="M25.603 102.838C26.5601 102.838 27.3154 102.646 27.8691 102.264C28.4297 101.881 28.71 101.19 28.71 100.192C28.71 99.1191 28.3203 98.3877 27.541 97.998C27.124 97.793 26.5669 97.6904 25.8696 97.6904H20.8862V102.838H25.603ZM18.8457 95.937H25.8184C26.9668 95.937 27.9136 96.1045 28.6587 96.4395C30.0737 97.082 30.7812 98.2681 30.7812 99.9976C30.7812 100.9 30.5933 101.638 30.2173 102.212C29.8481 102.787 29.3286 103.248 28.6587 103.597C29.2466 103.836 29.6875 104.15 29.9814 104.54C30.2822 104.93 30.4497 105.562 30.4839 106.437L30.5557 108.457C30.5762 109.031 30.624 109.458 30.6992 109.739C30.8223 110.217 31.041 110.525 31.3555 110.662V111H28.8535C28.7852 110.87 28.7305 110.703 28.6895 110.498C28.6484 110.292 28.6143 109.896 28.5869 109.308L28.4639 106.796C28.416 105.812 28.0503 105.152 27.3667 104.817C26.9771 104.632 26.3652 104.54 25.5312 104.54H20.8862V111H18.8457V95.937ZM38.1025 99.772C38.8818 99.772 39.6372 99.9565 40.3687 100.326C41.1001 100.688 41.6572 101.16 42.04 101.741C42.4092 102.294 42.6553 102.94 42.7783 103.679C42.8877 104.185 42.9424 104.991 42.9424 106.099H34.8931C34.9272 107.213 35.1904 108.108 35.6826 108.785C36.1748 109.455 36.937 109.79 37.9692 109.79C38.9331 109.79 39.7021 109.472 40.2764 108.836C40.6045 108.467 40.8369 108.04 40.9736 107.555H42.7886C42.7407 107.958 42.5801 108.409 42.3066 108.908C42.04 109.4 41.7393 109.804 41.4043 110.118C40.8438 110.665 40.1499 111.034 39.3228 111.226C38.8784 111.335 38.376 111.39 37.8154 111.39C36.4482 111.39 35.2896 110.894 34.3394 109.903C33.3892 108.905 32.9141 107.51 32.9141 105.719C32.9141 103.956 33.3926 102.523 34.3496 101.423C35.3066 100.322 36.5576 99.772 38.1025 99.772ZM41.0454 104.632C40.9702 103.833 40.7959 103.193 40.5225 102.715C40.0166 101.826 39.1724 101.382 37.9897 101.382C37.1421 101.382 36.4312 101.689 35.8569 102.305C35.2827 102.913 34.9785 103.689 34.9443 104.632H41.0454ZM45.5879 96.9521H47.4541V100.018H49.2075V101.525H47.4541V108.693C47.4541 109.076 47.584 109.332 47.8438 109.462C47.9873 109.537 48.2266 109.575 48.5615 109.575C48.6504 109.575 48.7461 109.575 48.8486 109.575C48.9512 109.568 49.0708 109.558 49.2075 109.544V111C48.9956 111.062 48.7734 111.106 48.541 111.133C48.3154 111.161 48.0693 111.174 47.8027 111.174C46.9414 111.174 46.3569 110.956 46.0493 110.518C45.7417 110.074 45.5879 109.5 45.5879 108.795V101.525H44.1011V100.018H45.5879V96.9521ZM51.0635 100.069H52.9399V111H51.0635V100.069ZM51.0635 95.937H52.9399V98.0288H51.0635V95.937ZM55.7905 100.018H57.5439V101.915C57.6875 101.546 58.0396 101.098 58.6001 100.572C59.1606 100.039 59.8066 99.772 60.5381 99.772C60.5723 99.772 60.6304 99.7754 60.7124 99.7822C60.7944 99.7891 60.9346 99.8027 61.1328 99.8232V101.771C61.0234 101.751 60.9209 101.737 60.8252 101.73C60.7363 101.724 60.6372 101.72 60.5278 101.72C59.5981 101.72 58.8838 102.021 58.3848 102.623C57.8857 103.217 57.6362 103.904 57.6362 104.684V111H55.7905V100.018ZM62.7324 100.069H64.6089V111H62.7324V100.069ZM62.7324 95.937H64.6089V98.0288H62.7324V95.937ZM67.4082 100.018H69.1616V101.577C69.6812 100.934 70.2314 100.473 70.8125 100.192C71.3936 99.9121 72.0396 99.772 72.7505 99.772C74.3091 99.772 75.3618 100.315 75.9087 101.402C76.2095 101.997 76.3599 102.848 76.3599 103.956V111H74.4834V104.079C74.4834 103.409 74.3843 102.869 74.186 102.458C73.8579 101.775 73.2632 101.433 72.4019 101.433C71.9644 101.433 71.6055 101.478 71.3252 101.566C70.8193 101.717 70.375 102.018 69.9922 102.469C69.6846 102.831 69.4829 103.207 69.3872 103.597C69.2983 103.979 69.2539 104.53 69.2539 105.248V111H67.4082V100.018ZM82.9736 99.8232C83.835 99.8232 84.5869 100.035 85.2295 100.459C85.5781 100.698 85.9336 101.047 86.2959 101.505V100.121H87.998V110.108C87.998 111.502 87.793 112.603 87.3828 113.41C86.6172 114.9 85.1714 115.645 83.0454 115.645C81.8628 115.645 80.8682 115.378 80.0615 114.845C79.2549 114.319 78.8037 113.492 78.708 112.364H80.5845C80.6733 112.856 80.8511 113.235 81.1177 113.502C81.5347 113.912 82.1909 114.117 83.0864 114.117C84.5015 114.117 85.4277 113.618 85.8652 112.62C86.125 112.032 86.2446 110.983 86.2241 109.472C85.855 110.033 85.4106 110.45 84.8911 110.723C84.3716 110.997 83.6846 111.133 82.8301 111.133C81.6406 111.133 80.5981 110.713 79.7026 109.872C78.814 109.024 78.3696 107.626 78.3696 105.678C78.3696 103.839 78.8174 102.404 79.7129 101.372C80.6152 100.339 81.7021 99.8232 82.9736 99.8232ZM86.2959 105.463C86.2959 104.103 86.0156 103.094 85.4551 102.438C84.8945 101.782 84.1802 101.454 83.312 101.454C82.0132 101.454 81.1245 102.062 80.646 103.279C80.3931 103.928 80.2666 104.779 80.2666 105.832C80.2666 107.069 80.5161 108.013 81.0151 108.662C81.521 109.305 82.1978 109.626 83.0454 109.626C84.3716 109.626 85.3047 109.028 85.8447 107.832C86.1455 107.155 86.2959 106.365 86.2959 105.463Z" fill="#273F62"/>
<line x1="213.5" y1="48" x2="213.5" y2="104" stroke="#EFC848"/>
<line x1="307.604" y1="104.446" x2="238.225" y2="139.446" stroke="#EFC848"/>
<line x1="186.831" y1="137.471" x2="97.8308" y2="105.471" stroke="#EFC848"/>
<line x1="177.343" y1="197.364" x2="124.343" y2="247.364" stroke="#EFC848"/>
<line x1="246.34" y1="196.634" x2="302.34" y2="248.634" stroke="#EFC848"/>
<defs>
<clipPath id="clip0_5651_196554">
<rect width="79" height="79" fill="white" transform="translate(174 120)"/>
</clipPath>
</defs>
</svg>
