<svg width="19" height="19" viewBox="0 0 19 19" fill="none" xmlns="http://www.w3.org/2000/svg">
<g clip-path="url(#clip0_293_20807)">
<path d="M5.94011 15.665L4.75391 17.8053" stroke="#404040" stroke-width="1.5" stroke-linecap="round" stroke-linejoin="round"/>
<path d="M13.0605 15.665L14.2468 17.8053" stroke="#404040" stroke-width="1.5" stroke-linecap="round" stroke-linejoin="round"/>
<path d="M9.49955 16.6192C13.4311 16.6192 16.6182 13.4321 16.6182 9.50053C16.6182 5.56898 13.4311 2.38184 9.49955 2.38184C5.56801 2.38184 2.38086 5.56898 2.38086 9.50053C2.38086 13.4321 5.56801 16.6192 9.49955 16.6192Z" stroke="#404040" stroke-width="1.5" stroke-linecap="round" stroke-linejoin="round"/>
<path d="M2.61992 7.60276C2.0734 7.19314 1.65628 6.63493 1.41833 5.99473C1.18037 5.35454 1.13163 4.6594 1.27792 3.99227C1.42421 3.32513 1.75935 2.71417 2.24335 2.23229C2.72736 1.75041 3.33978 1.41796 4.00756 1.2746C4.67533 1.13125 5.37024 1.18304 6.00938 1.42381C6.64852 1.66458 7.2049 2.08415 7.61212 2.63246" stroke="#404040" stroke-width="1.5" stroke-linecap="round" stroke-linejoin="round"/>
<path d="M9.5 2.38176L9.50004 1.19531" stroke="#404040" stroke-width="1.5" stroke-linecap="round" stroke-linejoin="round"/>
<path d="M9.5 5.94141V9.50074" stroke="#404040" stroke-width="1.5" stroke-linecap="round" stroke-linejoin="round"/>
<path d="M9.5 9.5L12.0168 12.0168" stroke="#404040" stroke-width="1.5" stroke-linecap="round" stroke-linejoin="round"/>
<path d="M16.3809 7.60276C16.9274 7.19314 17.3445 6.63493 17.5825 5.99473C17.8204 5.35454 17.8692 4.6594 17.7229 3.99227C17.5766 3.32513 17.2414 2.71417 16.7574 2.23229C16.2734 1.75041 15.661 1.41796 14.9932 1.2746C14.3255 1.13125 13.6305 1.18304 12.9914 1.42381C12.3523 1.66458 11.7959 2.08415 11.3887 2.63245" stroke="#404040" stroke-width="1.5" stroke-linecap="round" stroke-linejoin="round"/>
</g>
<defs>
<clipPath id="clip0_293_20807">
<rect width="19" height="19" fill="white"/>
</clipPath>
</defs>
</svg>
