<svg width="16" height="16" viewBox="0 0 16 16" fill="none" xmlns="http://www.w3.org/2000/svg">
<mask id="mask0_25823_162" style="mask-type:alpha" maskUnits="userSpaceOnUse" x="0" y="0" width="16" height="16">
<rect width="16" height="16" fill="#D9D9D9"/>
</mask>
<g mask="url(#mask0_25823_162)">
<path fill-rule="evenodd" clip-rule="evenodd" d="M2.40526 14.9274C2.67544 15.1976 3.00351 15.3327 3.38947 15.3327H12.1895C12.5754 15.3327 12.9035 15.1976 13.1737 14.9274C13.4439 14.6572 13.5789 14.3292 13.5789 13.9432V5.29759C13.5789 5.10461 13.5437 4.9245 13.4732 4.75724C13.4022 4.58999 13.3023 4.44204 13.1737 4.31338L9.93158 1.07128C9.80292 0.942624 9.65497 0.842788 9.48772 0.77177C9.32047 0.701267 9.14035 0.666016 8.94737 0.666016H3.38947C3.00351 0.666016 2.67544 0.801103 2.40526 1.07128C2.13509 1.34145 2 1.66952 2 2.05549V13.9432C2 14.3292 2.13509 14.6572 2.40526 14.9274ZM9.14961 5.09458C9.01478 4.95975 8.94737 4.79584 8.94737 4.60286V1.82391L12.4211 5.29759H9.64211C9.44912 5.29759 9.28496 5.22992 9.14961 5.09458ZM6.9405 11.4762C6.92624 11.4972 6.90685 11.5258 6.88488 11.5586C6.83867 11.6277 6.78188 11.7139 6.73754 11.7858C6.5643 12.0664 6.37593 12.3241 6.19352 12.5339C6.01287 12.7416 5.83163 12.9098 5.6715 13.0037C5.49741 13.1057 5.31375 13.1635 5.14431 13.17C4.97557 13.1764 4.80993 13.1315 4.69245 13.0141C4.58928 12.9109 4.53026 12.787 4.53346 12.6473C4.53656 12.5119 4.59775 12.3819 4.69287 12.261C4.88112 12.0219 5.23514 11.7772 5.72438 11.5341L6.29238 11.2518L6.5105 10.7746C6.64008 10.4911 6.8341 10.027 6.94079 9.74535L7.11946 9.27374L7.00065 8.93696C6.91305 8.68863 6.85492 8.38257 6.83181 8.10648C6.82021 7.968 6.8172 7.83443 6.82435 7.71714C6.83134 7.60244 6.84857 7.49321 6.88331 7.40933C6.97825 7.18012 7.18711 7.07385 7.39822 7.08981C7.60564 7.1055 7.80863 7.23688 7.92081 7.46075C8.00705 7.63286 8.03987 7.86065 8.03254 8.12007C8.02513 8.38178 7.97648 8.68733 7.88908 9.02339L7.76257 9.50983L7.85819 9.67214C7.9212 9.77911 8.11489 10.0471 8.28906 10.266L8.57058 10.6161L8.90528 10.5725C9.56165 10.4868 10.024 10.5131 10.3285 10.6272C10.483 10.685 10.6026 10.7676 10.6834 10.875C10.765 10.9835 10.8 11.108 10.8 11.2364C10.8 11.4184 10.7075 11.5591 10.5644 11.6483C10.427 11.734 10.2454 11.7719 10.0498 11.7723C9.65686 11.773 9.16125 11.6229 8.71327 11.3083C8.61186 11.237 8.52665 11.1663 8.46677 11.1134C8.45034 11.0988 8.43577 11.0856 8.42323 11.074L8.40404 11.078C8.34984 11.0893 8.27485 11.1051 8.19167 11.1231C8.02438 11.1594 7.82714 11.2039 7.69861 11.2385C7.44006 11.3082 7.30766 11.3523 6.9405 11.4762ZM5.81243 11.956C5.44677 12.1398 5.19264 12.3127 5.05289 12.4574C4.98255 12.5303 4.95067 12.5864 4.94047 12.6241C4.93238 12.654 4.93739 12.6702 4.95172 12.6875C4.96771 12.7068 4.97893 12.7141 4.9854 12.7171C4.99074 12.7197 4.9985 12.7221 5.01368 12.7208C5.05167 12.7176 5.11775 12.6937 5.23504 12.6212C5.308 12.5761 5.43648 12.4514 5.58623 12.2743C5.67268 12.172 5.76238 12.0569 5.84746 11.9384L5.81243 11.956ZM7.32809 8.5657C7.36269 8.4155 7.40102 8.2216 7.42649 8.06127C7.44013 7.94636 7.449 7.83755 7.44634 7.7453C7.4438 7.65726 7.43095 7.60167 7.41555 7.57148C7.38185 7.53762 7.35785 7.53039 7.34822 7.52932C7.34224 7.52866 7.33172 7.52851 7.31428 7.5466C7.27045 7.59206 7.21551 7.72709 7.23598 7.98734C7.24808 8.14109 7.28267 8.38603 7.32809 8.5657ZM7.57308 10.0053C7.5362 10.1127 7.49204 10.2349 7.45095 10.332L7.20492 10.9401C7.33672 10.899 7.48791 10.8532 7.59439 10.8254C7.71836 10.793 7.90371 10.7526 8.05594 10.7207L8.11489 10.7085L8.08187 10.668C7.96557 10.5448 7.77833 10.3027 7.658 10.1213C7.62663 10.08 7.59832 10.0412 7.57308 10.0053ZM9.01977 10.9879C9.14336 11.0585 9.45763 11.196 9.68571 11.2658C9.90791 11.3338 9.98944 11.3111 10.0392 11.2756L10.0403 11.2748C10.1308 11.2114 10.1314 11.0789 10.0067 11.0162C9.87924 10.952 9.78051 10.9335 9.36852 10.9395C9.25886 10.9471 9.12233 10.9608 8.99782 10.975L9.01977 10.9879Z" fill="#3D597A"/>
</g>
</svg>
