<svg width="20" height="20" viewBox="0 0 14 14" fill="none" xmlns="http://www.w3.org/2000/svg">
<rect width="14" height="14" rx="7" fill="#6DAE4E" fill-opacity="0.2"/>
<mask id="mask0_14261_3554" style="mask-type:alpha" maskUnits="userSpaceOnUse" x="0" y="0" width="14" height="14">
<rect width="14" height="14" fill="#D9D9D9"/>
</mask>
<g mask="url(#mask0_14261_3554)">
<path d="M5.83314 8.13796L9.37689 4.59421C9.45467 4.51643 9.55675 4.47754 9.68314 4.47754C9.80953 4.47754 9.91161 4.51643 9.98939 4.59421C10.0672 4.67198 10.1061 4.77407 10.1061 4.90046C10.1061 5.02684 10.0672 5.12893 9.98939 5.20671L6.19772 8.98379C6.09078 9.09073 5.96925 9.14421 5.83314 9.14421C5.69703 9.14421 5.5755 9.09073 5.46855 8.98379L4.01022 7.54004C3.93244 7.46226 3.89355 7.36018 3.89355 7.23379C3.89355 7.1074 3.93244 7.00532 4.01022 6.92754C4.088 6.84976 4.19008 6.81087 4.31647 6.81087C4.44286 6.81087 4.54494 6.84976 4.62272 6.92754L5.83314 8.13796Z" fill="#6DAE4E"/>
</g>
</svg>
