<svg width="22" height="16" viewBox="0 0 22 16" fill="none" xmlns="http://www.w3.org/2000/svg">
<path d="M5.49998 15.5C4.11794 15.5 2.9391 15.0198 1.96345 14.0596C0.987817 13.0993 0.5 11.9282 0.5 10.5461C0.5 9.32306 0.891667 8.23524 1.675 7.28268C2.45833 6.33013 3.45769 5.76667 4.67308 5.59232C4.99359 4.09744 5.74519 2.875 6.92788 1.925C8.11056 0.975 9.46793 0.5 11 0.5C12.8089 0.5 14.3445 1.13109 15.6067 2.39328C16.8689 3.65544 17.5 5.19101 17.5 6.99998V7.5H17.8077C18.8615 7.58205 19.7403 8.00577 20.4442 8.77115C21.148 9.53653 21.5 10.4461 21.5 11.5C21.5 12.6153 21.1121 13.5609 20.3365 14.3365C19.5609 15.1121 18.6153 15.5 17.5 15.5H11.75V8.21533L13.0827 9.53265C13.2211 9.67112 13.3926 9.74035 13.5971 9.74035C13.8016 9.74035 13.9782 9.66599 14.1269 9.51728C14.2718 9.37881 14.3426 9.20317 14.3394 8.99035C14.3362 8.77753 14.2653 8.6019 14.1269 8.46345L11.6327 5.96923C11.4519 5.78846 11.241 5.69808 11 5.69808C10.759 5.69808 10.5481 5.78846 10.3673 5.96923L7.87308 8.46345C7.73461 8.6019 7.66121 8.77498 7.65288 8.98268C7.64454 9.19036 7.71794 9.36856 7.87308 9.51728C8.01153 9.65573 8.18459 9.72592 8.39228 9.72785C8.59998 9.72977 8.77818 9.66149 8.92688 9.52303L10.25 8.21533V15.5H5.49998Z" fill="#3D597A"/>
</svg>
