<?xml version="1.0" encoding="UTF-8"?>
<svg id="Layer_2" xmlns="http://www.w3.org/2000/svg" viewBox="0 0 25 25">
    <defs>
        <style>.cls-1{fill:#e8e8e8;}.cls-2{fill:none;stroke:#666666;stroke-miterlimit:10;}</style>
    </defs>
    <g id="Layer_1-2">
        <circle class="cls-1" cx="12.5" cy="12.5" r="12.5"/>
        <g>
            <polyline class="cls-2" points="8.79 16.01 12.53 12.26 8.77 8.5"/>
            <polyline class="cls-2" points="16.29 8.5 12.54 12.24 16.31 16.01"/>
        </g>
    </g>
</svg>
