<svg width="23" height="23" viewBox="0 0 23 23" fill="none" xmlns="http://www.w3.org/2000/svg">
<path d="M11.3 0C5.05906 0 0 5.05883 0 11.3C0 17.5412 5.05883 22.6 11.3 22.6C17.5412 22.6 22.6 17.5412 22.6 11.3C22.6 5.05883 17.5412 0 11.3 0ZM16.173 9.32654L9.91362 15.5859C9.81475 15.6848 9.7017 15.7575 9.58076 15.808C9.21548 15.9553 8.78377 15.8828 8.48714 15.5859L5.34125 12.44C5.1523 12.2509 5.04622 11.9943 5.04622 11.7268C5.04622 11.4593 5.15229 11.2028 5.34125 11.0136C5.53065 10.8244 5.78716 10.7183 6.05447 10.7183C6.32202 10.7183 6.57853 10.8244 6.76793 11.0136L9.20152 13.4469L14.7486 7.89985C14.9378 7.71091 15.1943 7.60483 15.4618 7.60483C15.7294 7.60483 15.9859 7.7109 16.1751 7.89985C16.3642 8.08926 16.4703 8.34577 16.4703 8.61331C16.4703 8.88063 16.3642 9.13737 16.1751 9.32654H16.173Z" fill="#647086"/>
</svg>
