<svg width="16" height="17" viewBox="0 0 16 17" fill="none" xmlns="http://www.w3.org/2000/svg">
<path d="M3.3077 16.9998C2.80257 16.9998 2.375 16.8248 2.025 16.4748C1.675 16.1248 1.5 15.6972 1.5 15.1921V2.49981H1.25C1.03718 2.49981 0.858983 2.42802 0.7154 2.28443C0.5718 2.14085 0.5 1.96265 0.5 1.74983C0.5 1.53702 0.5718 1.35882 0.7154 1.21523C0.858983 1.07163 1.03718 0.999834 1.25 0.999834H4.99997C4.99997 0.748568 5.08779 0.538317 5.26342 0.369084C5.43907 0.199851 5.65254 0.115234 5.90382 0.115234H10.0961C10.3474 0.115234 10.5609 0.199851 10.7365 0.369084C10.9122 0.538317 11 0.748568 11 0.999834H14.75C14.9628 0.999834 15.141 1.07163 15.2845 1.21523C15.4281 1.35882 15.5 1.53702 15.5 1.74983C15.5 1.96265 15.4281 2.14085 15.2845 2.28443C15.141 2.42802 14.9628 2.49981 14.75 2.49981H14.5V15.1921C14.5 15.6972 14.325 16.1248 13.975 16.4748C13.625 16.8248 13.1974 16.9998 12.6922 16.9998H3.3077ZM2.99997 2.49981V15.1921C2.99997 15.2818 3.02883 15.3556 3.08652 15.4133C3.14422 15.471 3.21795 15.4998 3.3077 15.4998H12.6922C12.782 15.4998 12.8557 15.471 12.9134 15.4133C12.9711 15.3556 13 15.2818 13 15.1921V2.49981H2.99997ZM5.40385 12.7498C5.40385 12.9626 5.47564 13.1409 5.61922 13.2844C5.76281 13.428 5.94101 13.4998 6.15382 13.4998C6.36664 13.4998 6.54484 13.428 6.68842 13.2844C6.83202 13.1409 6.90382 12.9626 6.90382 12.7498V5.24978C6.90382 5.03697 6.83202 4.85877 6.68842 4.71518C6.54484 4.5716 6.36664 4.49981 6.15382 4.49981C5.94101 4.49981 5.76281 4.5716 5.61922 4.71518C5.47564 4.85877 5.40385 5.03697 5.40385 5.24978V12.7498ZM9.09613 12.7498C9.09613 12.9626 9.16792 13.1409 9.31152 13.2844C9.45511 13.428 9.63331 13.4998 9.84613 13.4998C10.0589 13.4998 10.2371 13.428 10.3807 13.2844C10.5243 13.1409 10.5961 12.9626 10.5961 12.7498V5.24978C10.5961 5.03697 10.5243 4.85877 10.3807 4.71518C10.2371 4.5716 10.0589 4.49981 9.84613 4.49981C9.63331 4.49981 9.45511 4.5716 9.31152 4.71518C9.16792 4.85877 9.09613 5.03697 9.09613 5.24978V12.7498ZM2.99997 2.49981V15.1921C2.99997 15.2818 3.02883 15.3556 3.08652 15.4133C3.14422 15.471 3.21795 15.4998 3.3077 15.4998H2.99997V2.49981Z" fill="#00284A"/>
</svg>
