<svg width="24" height="24" viewBox="0 0 24 24" fill="none" xmlns="http://www.w3.org/2000/svg">
<path d="M3.34938 4.82091C2.63813 4.82091 2.09424 4.29265 2.09424 3.60186C2.09424 2.91107 2.63813 2.38281 3.34938 2.38281C4.06063 2.38281 4.60453 2.91107 4.60453 3.60186C4.60453 4.25202 4.06063 4.82091 3.34938 4.82091Z" fill="#00050A"/>
<path d="M2.09424 7.66436C2.09424 6.97357 2.63813 6.44531 3.34938 6.44531C4.06063 6.44531 4.60453 6.97357 4.60453 7.66436C4.60453 8.35515 4.06063 8.88341 3.34938 8.88341C2.63813 8.88341 2.09424 8.31452 2.09424 7.66436Z" fill="#D24614"/>
<path d="M2.09424 11.7308C2.09424 11.04 2.63813 10.5117 3.34938 10.5117C4.06063 10.5117 4.60453 11.04 4.60453 11.7308C4.60453 12.4216 4.06063 12.9498 3.34938 12.9498C2.63813 12.9498 2.09424 12.3809 2.09424 11.7308Z" fill="#FFC138"/>
<path d="M5.52539 23.0631L5.60907 22.2504L6.86421 22.1285C7.11524 22.1285 7.15708 22.0472 7.15708 21.8034L8.53773 12.2948C8.57957 12.051 8.53773 11.9698 8.32854 11.9698L7.11524 11.8479L7.19892 11.0352H11.8011L11.7174 11.8479L10.4205 11.9698C10.1694 12.0104 10.1276 12.051 10.1276 12.2948L8.70509 21.7628C8.66325 22.0472 8.66325 22.0472 8.91428 22.0879L10.1694 22.2098L10.0857 23.0225H5.52539V23.0631Z" fill="#999995"/>
<path d="M11.4663 23.0631L11.5918 22.2504L12.6378 22.1285C12.847 22.1285 12.8888 22.0472 12.9306 21.844L14.3113 12.2948C14.3531 12.051 14.3113 11.9698 14.1021 11.9698L13.0562 11.8479L13.1817 11.0352H18.2022C21.884 11.0352 23.4739 12.9856 23.4739 15.952C23.4739 20.0967 21.2146 23.1037 16.2359 23.1037H11.4663V23.0631ZM16.3614 21.8847C19.9595 21.8847 21.884 19.6091 21.884 15.9926C21.884 13.1482 20.2942 12.2136 17.742 12.2136H15.8593L14.4787 21.8847H16.3614Z" fill="#999995"/>
</svg>
