<svg width="14" height="10" viewBox="0 0 14 10" fill="none" xmlns="http://www.w3.org/2000/svg">
<path d="M8.271 9.25001C8.146 9.12501 8.0835 8.97556 8.0835 8.80167C8.0835 8.62834 8.146 8.47917 8.271 8.35417L11.021 5.625H1.2085C1.02794 5.625 0.878774 5.56584 0.760996 5.4475C0.642663 5.32973 0.583496 5.18056 0.583496 5C0.583496 4.81945 0.642663 4.67 0.760996 4.55167C0.878774 4.43389 1.02794 4.37501 1.2085 4.37501H11.021L8.25016 1.625C8.13905 1.5 8.0835 1.35417 8.0835 1.18751C8.0835 1.02084 8.146 0.875005 8.271 0.750005C8.396 0.611116 8.54183 0.541672 8.7085 0.541672C8.87516 0.541672 9.02794 0.611116 9.16683 0.750005L12.896 4.47917C12.9654 4.54862 13.0177 4.62834 13.0527 4.71834C13.0871 4.80889 13.1043 4.90278 13.1043 5C13.1043 5.09723 13.0871 5.19084 13.0527 5.28084C13.0177 5.37139 12.9654 5.45139 12.896 5.52084L9.146 9.27084C9.021 9.39584 8.87516 9.45834 8.7085 9.45834C8.54183 9.45834 8.396 9.38889 8.271 9.25001Z" fill="#CD1D8B"/>
</svg>
