<svg width="14" height="10" viewBox="0 0 14 10" fill="none" xmlns="http://www.w3.org/2000/svg">
<path d="M8.27051 9.24999C8.14551 9.12499 8.08301 8.97555 8.08301 8.80166C8.08301 8.62832 8.14551 8.47916 8.27051 8.35416L11.0205 5.62499H1.20801C1.02745 5.62499 0.878285 5.56582 0.760508 5.44749C0.642174 5.32971 0.583008 5.18055 0.583008 4.99999C0.583008 4.81943 0.642174 4.66999 0.760508 4.55166C0.878285 4.43388 1.02745 4.37499 1.20801 4.37499H11.0205L8.24967 1.62499C8.13856 1.49999 8.08301 1.35416 8.08301 1.18749C8.08301 1.02082 8.14551 0.87499 8.27051 0.74999C8.39551 0.611101 8.54134 0.541656 8.70801 0.541656C8.87467 0.541656 9.02745 0.611101 9.16634 0.74999L12.8955 4.47916C12.965 4.5486 13.0172 4.62832 13.0522 4.71832C13.0866 4.80888 13.1038 4.90277 13.1038 4.99999C13.1038 5.09721 13.0866 5.19082 13.0522 5.28082C13.0172 5.37138 12.965 5.45138 12.8955 5.52082L9.14551 9.27082C9.02051 9.39582 8.87467 9.45832 8.70801 9.45832C8.54134 9.45832 8.39551 9.38888 8.27051 9.24999Z" fill="white"/>
</svg>
