<?xml version="1.0" encoding="utf-8"?>
<!-- Generator: Adobe Illustrator 27.0.0, SVG Export Plug-In . SVG Version: 6.00 Build 0)  -->
<svg version="1.1" id="Calque_1" xmlns="http://www.w3.org/2000/svg" xmlns:xlink="http://www.w3.org/1999/xlink" x="0px" y="0px"
	 width="24px" height="24px" viewBox="0 0 24 24" style="enable-background:new 0 0 24 24;" xml:space="preserve">
<style type="text/css">
	.st0{fill:none;}
	.st1{fill:#842DB5;}
</style>
<path class="st0" d="M0,0h24v24H0V0z"/>
<path class="st1" d="M11.3,8.7l-4.6,4.6c-0.4,0.4-0.4,1,0,1.4s1,0.4,1.4,0l3.9-3.9l3.9,3.9c0.4,0.4,1,0.4,1.4,0s0.4-1,0-1.4
	l-4.6-4.6C12.3,8.3,11.7,8.3,11.3,8.7z"/>
</svg>
