<svg width="63" height="40" viewBox="0 0 63 40" fill="none" xmlns="http://www.w3.org/2000/svg">
<path fill-rule="evenodd" clip-rule="evenodd" d="M10.6649 1.88257C10.8087 2.24993 10.6274 2.66427 10.26 2.80803C8.28238 3.58188 6.62291 4.60632 5.26916 5.87438C3.94116 7.16036 2.87409 8.59193 2.06371 10.17C1.8835 10.521 1.45294 10.6594 1.10201 10.4792C0.75109 10.2989 0.612694 9.86838 0.792898 9.51746C1.67812 7.79361 2.84183 6.23543 4.27979 4.84385L4.28386 4.83992L4.28799 4.83604C5.79063 3.42731 7.61194 2.31018 9.73945 1.47768C10.1068 1.33393 10.5212 1.5152 10.6649 1.88257Z" fill="#99E1F9"/>
<path d="M17.7481 38.5714C15.5696 38.5714 13.6928 38.2865 12.1176 37.7168C10.5759 37.147 9.26882 36.393 8.19634 35.4545C7.15738 34.4826 6.31951 33.3934 5.68273 32.1868C5.07946 30.9803 4.61025 29.7235 4.2751 28.4164C3.97347 27.1093 3.77238 25.819 3.67183 24.5454C3.6048 23.2384 3.57129 22.0486 3.57129 20.9761C3.57129 20.2723 3.62156 19.3674 3.72211 18.2614C3.82265 17.1554 4.02374 15.9824 4.32537 14.7423C4.66052 13.5023 5.12973 12.2622 5.733 11.0222C6.36978 9.78214 7.20765 8.6594 8.24661 7.65395C9.31909 6.6485 10.6262 5.84415 12.1679 5.24088C13.7095 4.6041 15.5696 4.28571 17.7481 4.28571C19.893 4.28571 21.7364 4.53707 23.278 5.03979C24.8197 5.54251 26.1268 6.21281 27.1993 7.05068C28.3053 7.88855 29.1934 8.87724 29.8637 10.0167C30.534 11.1227 31.0367 12.2958 31.3719 13.5358C31.7405 14.7759 31.9919 16.0327 32.126 17.3062C32.26 18.5798 32.3271 19.8031 32.3271 20.9761C32.3271 21.948 32.2768 23.054 32.1762 24.2941C32.0757 25.5341 31.8578 26.8077 31.5227 28.1148C31.1876 29.4219 30.7016 30.7122 30.0648 31.9857C29.428 33.2258 28.5566 34.3318 27.4506 35.3037C26.3782 36.2757 25.0376 37.0633 23.4289 37.6665C21.8537 38.2698 19.9601 38.5714 17.7481 38.5714ZM17.7481 12.4801C16.9102 12.4801 16.2232 12.6979 15.6869 13.1336C15.1507 13.5693 14.715 14.1894 14.3798 14.9937C14.0782 15.7981 13.8604 16.7532 13.7263 17.8592C13.5922 18.9317 13.5252 20.1215 13.5252 21.4286C13.5252 22.5681 13.5755 23.6908 13.676 24.7968C13.8101 25.8693 14.0279 26.8245 14.3296 27.6623C14.6647 28.5002 15.1004 29.1705 15.6366 29.6732C16.2064 30.1759 16.9102 30.4273 17.7481 30.4273C19.5579 30.4273 20.7812 29.6397 21.418 28.0645C22.0883 26.4893 22.4234 24.2773 22.4234 21.4286C22.4234 18.5463 22.105 16.3343 21.4682 14.7926C20.865 13.2509 19.6249 12.4801 17.7481 12.4801Z" fill="#00B3EF"/>
<path d="M61.8978 25.5509C61.8978 28.1315 61.5459 30.2597 60.8421 31.9355C60.1718 33.6112 59.1831 34.9351 57.876 35.907C56.6024 36.8789 55.0607 37.566 53.2509 37.9682C51.4411 38.3703 49.4302 38.5714 47.2183 38.5714C46.7491 38.5714 46.1123 38.5379 45.3079 38.4709C44.5371 38.4374 43.6992 38.3536 42.7943 38.2195C41.8894 38.119 40.9677 37.9849 40.0293 37.8173C39.1244 37.6162 38.3201 37.3816 37.6163 37.1135C36.5438 36.7113 35.8902 36.3092 35.6556 35.907C35.421 35.4713 35.3708 34.9518 35.5048 34.3485L36.1584 30.9803C36.2924 30.31 36.4767 29.8911 36.7114 29.7235C36.9795 29.5559 37.5157 29.5224 38.3201 29.623C39.7947 29.824 41.2359 29.9916 42.6435 30.1257C44.0511 30.2262 45.2912 30.2765 46.3636 30.2765C47.2015 30.2765 47.9556 30.243 48.6259 30.1759C49.3297 30.1089 49.933 29.9413 50.4357 29.6732C50.9384 29.4051 51.3238 29.0197 51.592 28.517C51.8601 27.9807 51.9941 27.2434 51.9941 26.305C51.9941 25.6347 51.8266 25.1655 51.4914 24.8974C51.1563 24.5957 50.6368 24.3779 49.933 24.2438L42.9954 22.9367C42.2916 22.8027 41.8224 22.6016 41.5878 22.3335C41.3532 22.0653 41.2359 21.5626 41.2359 20.8253V18.7641C41.2359 18.1273 41.2694 17.6749 41.3364 17.4068C41.4034 17.1051 41.5878 16.8203 41.8894 16.5521L46.5145 12.7315L46.4642 12.5304H37.5157C36.7114 12.5304 36.3092 12.1282 36.3092 11.3238V5.94469C36.3092 5.10682 36.7114 4.68788 37.5157 4.68788H59.3339C59.8366 4.68788 60.155 4.78843 60.2891 4.98952C60.4231 5.19061 60.4902 5.509 60.4902 5.94469L60.4399 9.96648C60.4399 10.3351 60.3896 10.7206 60.2891 11.1227C60.222 11.5249 59.9204 11.9606 59.3842 12.4298L54.7088 16.5521L54.8094 16.7532L56.77 17.256C57.7419 17.5241 58.5463 17.9263 59.1831 18.4625C59.8534 18.9652 60.3896 19.5852 60.7918 20.3226C61.194 21.0264 61.4788 21.8307 61.6464 22.7356C61.814 23.607 61.8978 24.5454 61.8978 25.5509Z" fill="#00B3EF"/>
</svg>
