<svg width="1440" height="352" viewBox="0 0 1440 352" fill="none" xmlns="http://www.w3.org/2000/svg">
<path d="M0 40C0 40 279 0 720 0C1161 0 1440 40 1440 40V352C1440 352 1092 352 720 352C348 352 0 352 0 352V40Z" fill="#E6F7FD"/>
</svg>
