{
  "redirects": [
    {
      "source": "/dsd(.*)",
      "destination": "/",
      "permanent": true
    },
    {
      "source": "/api(.*)",
      "destination": "/",
      "permanent": true
    }
  ],
  "cleanUrls": true
}
