<svg width="25" height="24" viewBox="0 0 25 24" fill="none" xmlns="http://www.w3.org/2000/svg">
<path d="M3.37202 5L9.54944 13.2598L3.33301 19.9754H4.73208L10.1746 14.0958L14.5719 19.9754H19.333L12.808 11.251L18.5942 5H17.1952L12.1829 10.415L8.1331 5H3.37202ZM5.42945 6.03056H7.61671L17.2753 18.9446H15.088L5.42945 6.03056Z" fill="#3D597A"/>
</svg>
