<svg width="77" height="41" viewBox="0 0 77 41" fill="none" xmlns="http://www.w3.org/2000/svg">
<path d="M26.5631 13.4686C26.5631 13.5818 26.5376 13.6698 26.4865 13.7326C26.4354 13.7955 26.3397 13.8269 26.1992 13.8269H24.8202C24.5776 13.8269 24.4563 13.7075 24.4563 13.4686L24.4754 8.16983C24.4754 7.6167 24.3797 7.17041 24.1881 6.83099C24.0094 6.49156 23.6455 6.32185 23.0964 6.32185C22.9049 6.32185 22.6814 6.35328 22.4261 6.41613C22.1835 6.47899 21.9345 6.5607 21.6791 6.66127C21.4365 6.74927 21.2066 6.84356 20.9896 6.94413C20.7725 7.03213 20.6001 7.10756 20.4724 7.17041V13.4686C20.4724 13.7075 20.3511 13.8269 20.1085 13.8269H18.7487C18.5061 13.8269 18.3848 13.7075 18.3848 13.4686V4.96415C18.3848 4.71272 18.5061 4.58701 18.7487 4.58701H20.1085C20.3511 4.58701 20.4724 4.71272 20.4724 4.96415V5.52986C20.4852 5.52986 20.4916 5.53614 20.4916 5.54871C20.5044 5.54871 20.5171 5.54871 20.5299 5.54871C20.7087 5.423 20.9194 5.29729 21.162 5.17157C21.4173 5.03329 21.6855 4.90758 21.9664 4.79443C22.2473 4.68129 22.541 4.59329 22.8474 4.53044C23.1539 4.45501 23.4539 4.41729 23.7476 4.41729C24.3988 4.41729 24.9096 4.51786 25.2799 4.71901C25.6502 4.90758 25.9311 5.16529 26.1226 5.49214C26.3141 5.819 26.4354 6.20242 26.4865 6.64242C26.5376 7.06984 26.5631 7.52241 26.5631 8.00012V13.4686Z" fill="#002249"/>
<path d="M35.7052 12.9595C35.7436 13.0978 35.7436 13.2109 35.7052 13.2989C35.6669 13.3869 35.5584 13.4686 35.3796 13.5441C35.0094 13.6949 34.5497 13.8018 34.0006 13.8646C33.4516 13.9401 32.9408 13.9778 32.4684 13.9778C31.5746 13.9778 30.8531 13.8458 30.3041 13.5818C29.7678 13.3178 29.3528 12.9658 29.0591 12.5258C28.7782 12.0858 28.5931 11.5767 28.5037 10.9984C28.4143 10.4075 28.3696 9.79153 28.3696 9.1504C28.3696 8.57212 28.4143 8.00012 28.5037 7.43441C28.6059 6.85613 28.7974 6.34699 29.0783 5.907C29.372 5.45443 29.787 5.08986 30.3232 4.81329C30.8723 4.53672 31.5873 4.39844 32.4684 4.39844C32.6855 4.39844 32.9217 4.40472 33.177 4.41729C33.4452 4.42987 33.7069 4.45501 33.9623 4.49272C34.2305 4.53044 34.4858 4.58072 34.7284 4.64358C34.9838 4.69386 35.2137 4.76301 35.418 4.851C35.6478 4.95158 35.7436 5.12757 35.7052 5.379L35.5712 6.13328C35.5329 6.27156 35.469 6.35328 35.3796 6.37842C35.2903 6.40356 35.1562 6.40985 34.9774 6.39728C34.5816 6.35956 34.173 6.32185 33.7516 6.28414C33.343 6.24642 32.9727 6.22756 32.6408 6.22756C31.8619 6.22756 31.3192 6.44756 31.0128 6.88756C30.7063 7.32756 30.5531 8.06926 30.5531 9.11268C30.5531 9.70353 30.585 10.1938 30.6488 10.5835C30.7255 10.9732 30.8468 11.2875 31.0128 11.5264C31.1787 11.7652 31.3894 11.9349 31.6448 12.0355C31.9129 12.1235 32.2385 12.1675 32.6216 12.1675C32.9153 12.1675 33.2984 12.1549 33.7708 12.1298C34.256 12.0921 34.6965 12.0481 35.0924 11.9978C35.2456 11.9727 35.3605 11.9727 35.4371 11.9978C35.5137 12.0229 35.5648 12.1172 35.5903 12.2807L35.7052 12.9595Z" fill="#002249"/>
<path d="M39.1383 9.77268C39.1511 10.2504 39.2021 10.6464 39.2915 10.9607C39.3937 11.275 39.5405 11.5264 39.732 11.7149C39.9236 11.8909 40.1598 12.0167 40.4407 12.0921C40.7216 12.1675 41.06 12.2052 41.4558 12.2052C41.8006 12.2052 42.2092 12.1801 42.6816 12.1298C43.154 12.0795 43.5754 12.0355 43.9457 11.9978C44.1245 11.9727 44.2458 11.9789 44.3096 12.0167C44.3862 12.0418 44.4373 12.1424 44.4628 12.3184L44.5777 12.9406C44.6033 13.0789 44.5969 13.1921 44.5586 13.2801C44.5331 13.3681 44.4309 13.4498 44.2521 13.5252C44.0606 13.6006 43.8372 13.6698 43.5818 13.7326C43.3264 13.7829 43.0583 13.8269 42.7774 13.8646C42.4964 13.9024 42.2155 13.9338 41.9346 13.9589C41.6537 13.9841 41.3983 13.9966 41.1685 13.9966C40.2492 13.9966 39.515 13.8646 38.9659 13.6006C38.4168 13.3366 37.9955 12.9846 37.7018 12.5447C37.4081 12.1047 37.2102 11.6018 37.1081 11.0361C37.0187 10.4578 36.974 9.86068 36.974 9.24468C36.974 8.79211 37.0123 8.28298 37.0889 7.71727C37.1655 7.15156 37.3379 6.62356 37.606 6.13328C37.887 5.643 38.2955 5.23443 38.8318 4.90758C39.3809 4.56815 40.1215 4.39844 41.0536 4.39844C41.9091 4.39844 42.5986 4.52415 43.1221 4.77558C43.6584 5.027 44.0734 5.35386 44.3671 5.75614C44.6607 6.14585 44.8587 6.59842 44.9608 7.11384C45.0757 7.61669 45.1396 8.11955 45.1523 8.6224C45.1651 8.96183 45.1076 9.2384 44.98 9.45211C44.8523 9.66582 44.5969 9.77268 44.2138 9.77268H39.1383ZM41.0536 6.09557C40.6961 6.09557 40.4024 6.14585 40.1725 6.24642C39.9427 6.34699 39.7512 6.49785 39.598 6.69899C39.4575 6.88756 39.3554 7.12641 39.2915 7.41555C39.2277 7.69212 39.183 8.00641 39.1574 8.3584H42.9497C42.9497 8.06926 42.9242 7.79269 42.8731 7.5287C42.8221 7.25213 42.7263 7.00699 42.5858 6.79327C42.4581 6.57956 42.2666 6.40985 42.0112 6.28414C41.7686 6.15842 41.4494 6.09557 41.0536 6.09557Z" fill="#002249"/>
<path d="M26.5631 36.5345C26.5631 36.6477 26.5376 36.7357 26.4865 36.7985C26.4354 36.8614 26.3397 36.8928 26.1992 36.8928H24.8202C24.5776 36.8928 24.4563 36.7734 24.4563 36.5345L24.4754 31.2357C24.4754 30.6826 24.3797 30.2363 24.1881 29.8969C24.0094 29.5574 23.6455 29.3877 23.0964 29.3877C22.9049 29.3877 22.6814 29.4192 22.4261 29.482C22.1835 29.5449 21.9345 29.6266 21.6791 29.7272C21.4365 29.8152 21.2066 29.9094 20.9896 30.01C20.7725 30.098 20.6001 30.1734 20.4725 30.2363V36.5345C20.4725 36.7734 20.3511 36.8928 20.1085 36.8928H18.7487C18.5061 36.8928 18.3848 36.7734 18.3848 36.5345V28.03C18.3848 27.7786 18.5061 27.6529 18.7487 27.6529H20.1085C20.3511 27.6529 20.4725 27.7786 20.4725 28.03V28.5957C20.4852 28.5957 20.4916 28.602 20.4916 28.6146C20.5044 28.6146 20.5171 28.6146 20.5299 28.6146C20.7087 28.4889 20.9193 28.3632 21.162 28.2375C21.4173 28.0992 21.6855 27.9735 21.9664 27.8603C22.2473 27.7472 22.541 27.6592 22.8474 27.5963C23.1539 27.5209 23.4539 27.4832 23.7476 27.4832C24.3988 27.4832 24.9096 27.5837 25.2799 27.7849C25.6502 27.9735 25.9311 28.2312 26.1226 28.558C26.3141 28.8849 26.4354 29.2683 26.4865 29.7083C26.5376 30.1357 26.5631 30.5883 26.5631 31.066V36.5345Z" fill="#002249"/>
<path d="M30.8978 34.5545C30.8978 35.3325 30.8978 36.2088 30.8978 36.6676C30.8978 36.8444 30.7546 36.9871 30.5778 36.9871H29.1302C28.9534 36.9871 28.8102 36.8439 28.8102 36.6672C28.8102 36.2448 28.8102 35.5034 28.8102 35.0637V23.9569C28.8102 23.7181 28.9315 23.5986 29.1741 23.5986H30.5339C30.7765 23.5986 30.8978 23.7181 30.8978 23.9569V34.5545Z" fill="#002249"/>
<path d="M37.384 34.2528C37.5244 33.8631 37.6521 33.4985 37.767 33.1591C37.8947 32.8197 38.0033 32.5243 38.0926 32.2728C38.1948 31.9711 38.2906 31.6946 38.3799 31.4431L39.5674 27.9735C39.6057 27.8603 39.6568 27.7786 39.7207 27.7283C39.7845 27.678 39.8867 27.6529 40.0271 27.6529H41.4444C41.5977 27.6529 41.6807 27.6906 41.6934 27.766C41.7062 27.8415 41.6934 27.9295 41.6551 28.03L37.1925 40.0231C37.1414 40.1488 37.0839 40.2368 37.0201 40.2871C36.9562 40.3373 36.8413 40.3625 36.6753 40.3625H35.3729C35.2197 40.3625 35.1303 40.3248 35.1048 40.2493C35.092 40.1739 35.1048 40.0859 35.1431 39.9853L36.3497 36.7985L32.9979 28.03C32.9596 27.9295 32.9469 27.8415 32.9596 27.766C32.9852 27.6906 33.0682 27.6529 33.2086 27.6529H34.6834C34.8111 27.6529 34.9005 27.6655 34.9516 27.6906C35.0026 27.7157 35.0537 27.7975 35.1048 27.9357L36.3497 31.4431L37.3074 34.2528H37.384Z" fill="#002249"/>
<path d="M56.9467 36.5722C56.9467 36.7859 56.8318 36.8928 56.602 36.8928H55.7976C55.5805 36.8928 55.472 36.7859 55.472 36.5722L55.4911 30.8209C55.4911 30.4186 55.4656 30.0917 55.4145 29.8403C55.3634 29.5763 55.2741 29.3689 55.1464 29.218C55.0314 29.0672 54.8718 28.9666 54.6675 28.9163C54.476 28.8534 54.2334 28.822 53.9397 28.822C53.7099 28.822 53.4417 28.866 53.1353 28.954C52.8288 29.042 52.5224 29.1426 52.2159 29.2557C51.9095 29.3689 51.6222 29.4883 51.3541 29.614C51.0859 29.7271 50.8816 29.8214 50.7412 29.8969V36.5722C50.7412 36.7859 50.6262 36.8928 50.3964 36.8928H49.6111C49.4068 36.8928 49.3047 36.7859 49.3047 36.5722V23.9192C49.3047 23.7055 49.4068 23.5986 49.6111 23.5986H50.3964C50.6262 23.5986 50.7412 23.7055 50.7412 23.9192V28.7089L50.7603 28.7277C50.9135 28.6272 51.1115 28.5077 51.3541 28.3694C51.6094 28.2312 51.884 28.0992 52.1776 27.9734C52.4841 27.8477 52.8033 27.7409 53.1353 27.6529C53.48 27.5649 53.8248 27.5209 54.1696 27.5209C54.7952 27.5209 55.2868 27.6089 55.6443 27.7849C56.0146 27.9609 56.2955 28.206 56.4871 28.5203C56.6786 28.822 56.7999 29.1866 56.851 29.614C56.9148 30.0414 56.9467 30.5066 56.9467 31.0094V36.5722Z" fill="#002249"/>
<path d="M66.8052 36.5722C66.8052 36.7859 66.6966 36.8928 66.4796 36.8928H65.6943C65.4645 36.8928 65.3496 36.7859 65.3496 36.5722V35.9122L65.3112 35.8745C65.158 35.9751 64.9537 36.0945 64.6983 36.2328C64.4557 36.3711 64.1876 36.5031 63.8939 36.6288C63.6002 36.7545 63.2874 36.8614 62.9554 36.9494C62.6234 37.0374 62.2851 37.0814 61.9403 37.0814C61.3146 37.0814 60.8167 36.9934 60.4464 36.8174C60.0761 36.6414 59.7888 36.4025 59.5845 36.1008C59.3929 35.7865 59.2653 35.4157 59.2014 34.9882C59.1503 34.5608 59.1248 34.0957 59.1248 33.5928V28.03C59.1248 27.8163 59.2333 27.7095 59.4504 27.7095H60.274C60.4783 27.7095 60.5804 27.8163 60.5804 28.03V33.6117C60.5804 34.0517 60.606 34.41 60.657 34.6865C60.7081 34.9631 60.7911 35.1831 60.906 35.3465C61.0337 35.5099 61.1997 35.6231 61.404 35.6859C61.6083 35.7488 61.8573 35.7802 62.151 35.7802C62.3808 35.7802 62.649 35.7362 62.9554 35.6482C63.2619 35.5602 63.5683 35.4597 63.8748 35.3465C64.1812 35.2334 64.4685 35.114 64.7366 34.9882C65.0048 34.8625 65.2155 34.762 65.3687 34.6865V28.03C65.3687 27.8163 65.4772 27.7095 65.6943 27.7095H66.4796C66.6966 27.7095 66.8052 27.8163 66.8052 28.03V36.5722Z" fill="#002249"/>
<path d="M76.7594 32.2351C76.7594 33.0145 76.6955 33.706 76.5678 34.3094C76.4529 34.9002 76.2422 35.4031 75.9358 35.8179C75.6421 36.2202 75.2399 36.5282 74.7291 36.7419C74.2312 36.9556 73.5991 37.0625 72.833 37.0625C72.5393 37.0625 72.2265 37.0499 71.8945 37.0248C71.5753 37.0122 71.2561 36.9871 70.9368 36.9494C70.6176 36.9117 70.3176 36.8677 70.0367 36.8174C69.7557 36.7545 69.5067 36.6854 69.2897 36.6099C69.0726 36.5345 68.9385 36.4277 68.8875 36.2894C68.8492 36.1385 68.83 35.9939 68.83 35.8557V23.9569C68.83 23.8186 68.8492 23.7306 68.8875 23.6929C68.9385 23.6426 69.0279 23.6175 69.1556 23.6175H69.96C70.1005 23.6175 70.1899 23.6426 70.2282 23.6929C70.2793 23.7432 70.3048 23.8312 70.3048 23.9569V28.0489L70.3239 28.0866C70.8985 27.8729 71.4093 27.7283 71.8562 27.6529C72.3031 27.5649 72.6989 27.5209 73.0437 27.5209C73.7843 27.5209 74.3972 27.634 74.8824 27.8603C75.3676 28.074 75.7443 28.3883 76.0124 28.8032C76.2933 29.218 76.4848 29.7146 76.587 30.2929C76.7019 30.8711 76.7594 31.5186 76.7594 32.2351ZM75.2271 32.4048C75.2271 31.7511 75.1888 31.198 75.1122 30.7454C75.0484 30.2803 74.9334 29.9094 74.7674 29.6329C74.6015 29.3437 74.3844 29.1363 74.1162 29.0106C73.8481 28.8849 73.5161 28.822 73.1203 28.822C72.7117 28.822 72.2648 28.8597 71.7796 28.9352C71.2944 28.998 70.8092 29.0986 70.3239 29.2369V35.5162C70.6942 35.5791 71.0901 35.6294 71.5114 35.6671C71.9456 35.6922 72.3669 35.7048 72.7755 35.7048C73.1458 35.7048 73.4842 35.6734 73.7906 35.6105C74.0971 35.5351 74.3525 35.3842 74.5568 35.158C74.7738 34.9191 74.9398 34.586 75.0547 34.1585C75.1697 33.7185 75.2271 33.134 75.2271 32.4048Z" fill="#002249"/>
<path fill-rule="evenodd" clip-rule="evenodd" d="M15.7224 11.0078C16.5536 9.11896 16.4959 6.73872 15.4726 4.68231C13.5723 0.863786 8.93637 -0.691297 5.11785 1.20894C1.29933 3.10917 -0.25575 7.74513 1.64448 11.5637C2.36581 13.0131 3.62407 14.2974 4.83047 15.5288C5.32931 16.038 5.8193 16.5381 6.25878 17.0371C8.29922 19.2488 8.86917 22.4443 7.71919 25.2251C7.71919 25.2251 6.57607 28.3345 5.90606 29.7879C5.23604 31.2412 5.20671 32.9742 5.97519 34.5185C7.32119 37.2233 10.605 38.3248 13.3098 36.9788C16.0146 35.6328 17.1161 32.349 15.7701 29.6442C15.6511 29.4051 15.5169 29.1785 15.3694 28.965L12.6589 24.7682C10.9858 22.2517 10.9342 18.9906 12.5268 16.4225C12.5268 16.4225 14.6681 13.4036 15.7224 11.0078ZM13.8532 30.5747C14.6312 32.1924 13.9506 34.1344 12.3329 34.9124C10.7153 35.6904 8.77322 35.0097 7.99523 33.3921C7.21725 31.7744 7.89792 29.8324 9.51557 29.0544C11.1332 28.2764 13.0753 28.9571 13.8532 30.5747ZM10.8385 12.6652C13.4267 11.4204 14.5158 8.31313 13.271 5.7249C12.0262 3.13667 8.91896 2.04758 6.33072 3.29236C3.74249 4.53713 2.6534 7.6444 3.89818 10.2326C5.14296 12.8209 8.25022 13.91 10.8385 12.6652Z" fill="#002147"/>
<path fill-rule="evenodd" clip-rule="evenodd" d="M7.71947 25.2251C8.86945 22.4443 8.2995 19.2488 6.25907 17.0371C10.0846 19.415 12.0259 23.4514 12.6591 24.7682L15.3697 28.965C15.5172 29.1784 15.6514 29.405 15.7704 29.6442C17.1164 32.349 16.0148 35.6328 13.3101 36.9787C10.6053 38.3248 7.32147 37.2232 5.97547 34.5185C5.207 32.9742 5.23632 31.2412 5.90634 29.7879C6.57635 28.3345 7.71947 25.2251 7.71947 25.2251ZM12.3333 34.9124C13.951 34.1344 14.6317 32.1924 13.8537 30.5747C13.0757 28.9571 11.1337 28.2764 9.51602 29.0544C7.89837 29.8324 7.21769 31.7744 7.99568 33.3921C8.77366 35.0097 10.7157 35.6904 12.3333 34.9124Z" fill="url(#paint0_linear_830_1058)"/>
<defs>
<linearGradient id="paint0_linear_830_1058" x1="8.97554" y1="19.5044" x2="9.68637" y2="38.3471" gradientUnits="userSpaceOnUse">
<stop stop-color="#842DB5"/>
<stop offset="1" stop-color="#EC8FFF"/>
</linearGradient>
</defs>
</svg>
