<svg width="63" height="40" viewBox="0 0 63 40" fill="none" xmlns="http://www.w3.org/2000/svg">
<path d="M18.4629 38.5714C16.2845 38.5714 14.4076 38.2865 12.8324 37.7168C11.2907 37.147 9.98366 36.393 8.91119 35.4545C7.87222 34.4826 7.03435 33.3934 6.39757 32.1868C5.7943 30.9803 5.32509 29.7235 4.98995 28.4164C4.68831 27.1093 4.48722 25.819 4.38668 24.5454C4.31965 23.2384 4.28613 22.0486 4.28613 20.9761C4.28613 20.2723 4.33641 19.3674 4.43695 18.2614C4.53749 17.1554 4.73858 15.9824 5.04022 14.7423C5.37537 13.5023 5.84457 12.2622 6.44784 11.0222C7.08462 9.78214 7.9225 8.6594 8.96146 7.65395C10.0339 6.6485 11.341 5.84415 12.8827 5.24088C14.4244 4.6041 16.2845 4.28571 18.4629 4.28571C20.6079 4.28571 22.4512 4.53707 23.9929 5.03979C25.5346 5.54251 26.8416 6.21281 27.9141 7.05068C29.0201 7.88855 29.9083 8.87724 30.5786 10.0167C31.2489 11.1227 31.7516 12.2958 32.0867 13.5358C32.4554 14.7759 32.7068 16.0327 32.8408 17.3062C32.9749 18.5798 33.0419 19.8031 33.0419 20.9761C33.0419 21.948 32.9916 23.054 32.8911 24.2941C32.7905 25.5341 32.5727 26.8077 32.2375 28.1148C31.9024 29.4219 31.4164 30.7122 30.7796 31.9857C30.1429 33.2258 29.2715 34.3318 28.1655 35.3037C27.093 36.2757 25.7524 37.0633 24.1437 37.6665C22.5685 38.2698 20.6749 38.5714 18.4629 38.5714ZM18.4629 12.4801C17.6251 12.4801 16.938 12.6979 16.4018 13.1336C15.8655 13.5693 15.4298 14.1894 15.0947 14.9937C14.793 15.7981 14.5752 16.7532 14.4411 17.8592C14.3071 18.9317 14.2401 20.1215 14.2401 21.4286C14.2401 22.5681 14.2903 23.6908 14.3909 24.7968C14.5249 25.8693 14.7428 26.8245 15.0444 27.6623C15.3796 28.5002 15.8153 29.1705 16.3515 29.6732C16.9212 30.1759 17.6251 30.4273 18.4629 30.4273C20.2727 30.4273 21.496 29.6397 22.1328 28.0645C22.8031 26.4893 23.1383 24.2773 23.1383 21.4286C23.1383 18.5463 22.8199 16.3343 22.1831 14.7926C21.5798 13.2509 20.3398 12.4801 18.4629 12.4801Z" fill="#00B3EF"/>
<path d="M40.1912 38.119C39.3868 38.119 38.9846 37.7 38.9846 36.8622V31.483C38.9846 30.6787 39.3868 30.2765 40.1912 30.2765H45.2184V13.5358H40.9453C40.4425 13.5358 40.0571 13.4855 39.789 13.385C39.5544 13.2509 39.4371 12.9325 39.4371 12.4298V9.41348C39.4371 8.97779 39.5041 8.59237 39.6382 8.25722C39.7722 7.92207 40.1074 7.62044 40.6436 7.35232L44.9168 5.34143C45.5871 5.00628 46.2071 4.82194 46.7768 4.78843C47.3466 4.7214 47.9666 4.68788 48.6369 4.68788H53.4631C54.368 4.68788 54.8204 5.10682 54.8204 5.94469V30.2765H60.2498C60.7525 30.2765 61.0709 30.377 61.205 30.5781C61.3391 30.7792 61.4061 31.0641 61.4061 31.4328V36.8622C61.4061 37.2979 61.3391 37.6162 61.205 37.8173C61.0709 38.0184 60.7525 38.119 60.2498 38.119H40.1912Z" fill="#00B3EF"/>
<path fill-rule="evenodd" clip-rule="evenodd" d="M10.6649 1.88257C10.8087 2.24993 10.6274 2.66427 10.26 2.80803C8.28238 3.58188 6.62291 4.60632 5.26916 5.87438C3.94116 7.16036 2.87409 8.59193 2.06371 10.17C1.8835 10.521 1.45294 10.6594 1.10201 10.4792C0.75109 10.2989 0.612694 9.86838 0.792898 9.51746C1.67812 7.79361 2.84183 6.23543 4.27979 4.84385L4.28386 4.83992L4.28799 4.83604C5.79063 3.42731 7.61194 2.31018 9.73945 1.47768C10.1068 1.33393 10.5212 1.5152 10.6649 1.88257Z" fill="#99E1F9"/>
</svg>
