{
  "@context": [
  "https://data-models-oots-tdd-8b6791fd33fcb1f29c7d6ad9c6173ba55d28c0a5f9.pages.code.europa.eu/Evidence/ProofOfBirth/releases/0.0.1/context/proofofbirth.jsonld",
  {
    "cv": "http://data.europa.eu/m8g/",
    "dct": "http://purl.org/dc/terms/",
    "ex": "http://example.com/",
    "foaf": "http://xmlns.com/foaf/0.1/",
    "locn": "http://www.w3.org/ns/locn#",
    "person": "http://www.w3.org/ns/person#"
  }],
  "@graph": [
    {
     "@id": "ex:proofofbirth1",
     "@type" : "ProofOfBirth",
     "dct:subject" : {
	   "@id": "ex:person1"
	 }
	},
    {
     "@id": "ex:person1",
     "@type": "Person",
     "foaf:givenName" : {
       "@language": "fr",
       "@value": "René François Ghislain"
     },
     "foaf:familyName" : {
       "@language": "fr",
       "@value": "Magritte"     
     },
      "cv:birthDate" : {
       "@type": "cv:genericDate",
       "@value": "1898-11-21"
     },
     "person:placeOfBirth" : {
       "@id": "ex:location1"
     },
     "person:countryOfBirth" : {
       "@id": "ex:location2"
     },
     "cv:sex" : {
       "@id" : "http://publications.europa.eu/resource/authority/human-sex/MALE"
     }
   },
   {
    "@id": "ex:location1",
    "@type": "Location",
    "locn:geographicName" : {
      "@language": "fr",
      "@value": "Lessines"
    }
   },
   {
    "@id": "ex:location2",
    "@type": "Location",
    "locn:geographicName" : {
      "@language": "fr",
      "@value": "Belgique"
    }
   }
 ]
}