{
  "@context": {
    "@vocab": "https://semiceu.github.io/OOTS/ProofOfDisabilityOfParent/releases/0.0.1/",
    "qb": "http://purl.org/linked-data/cube#",
    "qb:codeList": {
      "@id": "qb:codeList",
      "@type": "@id"
    },
    "rdf": "http://www.w3.org/1999/02/22-rdf-syntax-ns#",
    "rdf:first": {
      "@type": "@id"
    },
    "rdf:rest": {
      "@type": "@id"
    },
    "rdfs": "http://www.w3.org/2000/01/rdf-schema#",
    "rdfs:comment": {
      "@id": "rdfs:comment"
    },
    "sh": "http://www.w3.org/ns/shacl#",
    "sh:and": {
      "@container": "@set",
      "@id": "sh:and",
      "@type": "@id"
    },
    "sh:class": {
      "@id": "sh:class",
      "@type": "@id"
    },
    "sh:datatype": {
      "@id": "sh:datatype",
      "@type": "@id"
    },
    "sh:description": {
      "@container": "@language",
      "@id": "sh:description"
    },
    "sh:hasValue": {
      "@id": "sh:hasValue",
      "@type": "@id"
    },
    "sh:in": {
      "@container": "@set",
      "@id": "sh:in",
      "@type": "@id"
    },
    "sh:maxCount": {
      "@id": "sh:maxCount",
      "@type": "http://www.w3.org/2001/XMLSchema#integer"
    },
    "sh:minCount": {
      "@id": "sh:minCount",
      "@type": "http://www.w3.org/2001/XMLSchema#integer"
    },
    "sh:name": {
      "@container": "@language",
      "@id": "sh:name"
    },
    "sh:node": {
      "@id": "sh:node",
      "@type": "@id"
    },
    "sh:nodeKind": {
      "@id": "sh:nodeKind",
      "@type": "@id"
    },
    "sh:or": {
      "@container": "@set",
      "@id": "sh:or",
      "@type": "@id"
    },
    "sh:path": {
      "@id": "sh:path",
      "@type": "@id"
    },
    "sh:property": {
      "@id": "sh:property",
      "@type": "@id"
    },
    "sh:severity": {
      "@id": "sh:severity",
      "@type": "@id"
    },
    "sh:targetClass": {
      "@id": "sh:targetClass",
      "@type": "@id"
    },
    "sh:uniqueLang": {
      "@id": "sh:uniqueLang",
      "@type": "http://www.w3.org/2001/XMLSchema#boolean"
    },
    "shapes": {
      "@id": "rdfs:member",
      "@type": "@id"
    },
    "skos": "http://www.w3.org/2004/02/skos/core#",
    "vl": "https://purl.eu/ns/shacl#",
    "vl:message": {
      "@container": "@language",
      "@id": "vl:message"
    }
  },
  "@id": "https://semiceu.github.io/OOTS/ProofOfDisabilityOfParent/releases/0.0.1/",
  "shapes": [
    {
      "@id": "https://semiceu.github.io/OOTS/ProofOfDisabilityOfParent/releases/0.0.1/#EvidenceTypeShape",
      "@type": "sh:NodeShape",
      "sh:closed": false,
      "sh:property": [],
      "sh:targetClass": "http://data.europa.eu/m8g/EvidenceType"
    },
    {
      "@id": "https://semiceu.github.io/OOTS/ProofOfDisabilityOfParent/releases/0.0.1/#GenericDateShape",
      "@type": "sh:NodeShape",
      "sh:closed": false,
      "sh:property": [],
      "sh:targetClass": "http://data.europa.eu/m8g/GenericDate"
    },
    {
      "@id": "https://semiceu.github.io/OOTS/ProofOfDisabilityOfParent/releases/0.0.1/#DisabilityShape",
      "@type": "sh:NodeShape",
      "sh:closed": false,
      "sh:property": [
        {
          "@id": "https://semiceu.github.io/OOTS/ProofOfDisabilityOfParent/releases/0.0.1/#DisabilityShape/005c395f4252c3c7c753ae7dff2d6bbf54a237d3",
          "rdfs:seeAlso": "https://semiceu.github.io/OOTS/ProofOfDisabilityOfParent/releases/0.0.1/#Disability.dateofexpiryofdisabilitystatus",
          "sh:description": {
            "en": "The point in time on which the proof of disability ends."
          },
          "sh:name": {
            "en": "date of expiry of disability status"
          },
          "sh:nodeKind": "sh:Literal",
          "sh:path": "http://data.europa.eu/p4s/dateOfExipryOfDisabilityStatus"
        },
        {
          "@id": "https://semiceu.github.io/OOTS/ProofOfDisabilityOfParent/releases/0.0.1/#DisabilityShape/1c307dee653432c9533384db0d2f2775bd22c044",
          "rdfs:seeAlso": "https://semiceu.github.io/OOTS/ProofOfDisabilityOfParent/releases/0.0.1/#Disability.disabilitydegree",
          "sh:class": "http://www.w3.org/2004/02/skos/core#Concept",
          "sh:description": {
            "en": "Extent or magnitude of impairment."
          },
          "sh:name": {
            "en": "disability degree"
          },
          "sh:path": "http://data.europa.eu/p4s/disabilityDegree"
        },
        {
          "@id": "https://semiceu.github.io/OOTS/ProofOfDisabilityOfParent/releases/0.0.1/#DisabilityShape/56dc431c9e17a9acbde0983e3fa2b35e0dad672f",
          "rdfs:seeAlso": "https://semiceu.github.io/OOTS/ProofOfDisabilityOfParent/releases/0.0.1/#Disability.typeofdisability",
          "sh:class": "http://www.w3.org/2004/02/skos/core#Concept",
          "sh:description": {
            "en": "The impairment type of a Person, e.g. aural, skeletal, ocular, mobility, intellectual..."
          },
          "sh:name": {
            "en": "type of disability"
          },
          "sh:path": "http://data.europa.eu/p4s/typeOfDisability"
        },
        {
          "@id": "https://semiceu.github.io/OOTS/ProofOfDisabilityOfParent/releases/0.0.1/#DisabilityShape/74e939cd7b5f551cc4551babed0ec2fa1f97ad5f",
          "rdfs:seeAlso": "https://semiceu.github.io/OOTS/ProofOfDisabilityOfParent/releases/0.0.1/#Disability.dateofissueofdisabilitystatus",
          "sh:description": {
            "en": "The point in time on which the Person has acquired its disability."
          },
          "sh:name": {
            "en": "date of issue of disability status"
          },
          "sh:nodeKind": "sh:Literal",
          "sh:path": "http://data.europa.eu/p4s/dateOfIssueOfDisabilityStatus"
        },
        {
          "@id": "https://semiceu.github.io/OOTS/ProofOfDisabilityOfParent/releases/0.0.1/#DisabilityShape/9e639a2a673da60aa146f706a1e37986c01d4807",
          "rdfs:seeAlso": "https://semiceu.github.io/OOTS/ProofOfDisabilityOfParent/releases/0.0.1/#Disability.disabilitydegree",
          "sh:description": {
            "en": "Extent or magnitude of impairment."
          },
          "sh:name": {
            "en": "disability degree"
          },
          "sh:nodeKind": "sh:BlankNodeOrIRI",
          "sh:path": "http://data.europa.eu/p4s/disabilityDegree"
        },
        {
          "@id": "https://semiceu.github.io/OOTS/ProofOfDisabilityOfParent/releases/0.0.1/#DisabilityShape/e5aa7a95575cb721caca2fca7db8e9a0ee7f2c27",
          "rdfs:seeAlso": "https://semiceu.github.io/OOTS/ProofOfDisabilityOfParent/releases/0.0.1/#Disability.typeofdisability",
          "sh:description": {
            "en": "The impairment type of a Person, e.g. aural, skeletal, ocular, mobility, intellectual..."
          },
          "sh:name": {
            "en": "type of disability"
          },
          "sh:nodeKind": "sh:BlankNodeOrIRI",
          "sh:path": "http://data.europa.eu/p4s/typeOfDisability"
        }
      ],
      "sh:targetClass": "http://data.europa.eu/p4s/Disability"
    },
    {
      "@id": "https://semiceu.github.io/OOTS/ProofOfDisabilityOfParent/releases/0.0.1/#ProofOfDisabilityOfParentShape",
      "@type": "sh:NodeShape",
      "sh:closed": false,
      "sh:property": [
        {
          "@id": "https://semiceu.github.io/OOTS/ProofOfDisabilityOfParent/releases/0.0.1/#ProofOfDisabilityOfParentShape/3bd64a2b190eb54b4b154a0a714d23f9fcdd2385",
          "rdfs:seeAlso": "https://semiceu.github.io/OOTS/ProofOfDisabilityOfParent/releases/0.0.1/#Proofofdisabilityofparent.isAbout",
          "sh:description": {
            "en": "Agent that is the subject in the provided Evidence."
          },
          "sh:name": {
            "en": "isAbout"
          },
          "sh:nodeKind": "sh:BlankNodeOrIRI",
          "sh:path": "http://purl.org/dc/terms/subject"
        },
        {
          "@id": "https://semiceu.github.io/OOTS/ProofOfDisabilityOfParent/releases/0.0.1/#ProofOfDisabilityOfParentShape/46cf9cb834da99b063f51213ffe4ce791aade705",
          "rdfs:seeAlso": "https://semiceu.github.io/OOTS/ProofOfDisabilityOfParent/releases/0.0.1/#Proofofdisabilityofparent.states",
          "sh:class": "http://data.europa.eu/p4s/Disability",
          "sh:description": {
            "en": "Disability that is stated by the certificate"
          },
          "sh:name": {
            "en": "states"
          },
          "sh:path": "http://data.europa.eu/p4s/states"
        },
        {
          "@id": "https://semiceu.github.io/OOTS/ProofOfDisabilityOfParent/releases/0.0.1/#ProofOfDisabilityOfParentShape/8ce03c0e4701fd308ab35b871d3b512b3de93000",
          "rdfs:seeAlso": "https://semiceu.github.io/OOTS/ProofOfDisabilityOfParent/releases/0.0.1/#Proofofdisabilityofparent.states",
          "sh:description": {
            "en": "Disability that is stated by the certificate"
          },
          "sh:name": {
            "en": "states"
          },
          "sh:nodeKind": "sh:BlankNodeOrIRI",
          "sh:path": "http://data.europa.eu/p4s/states"
        },
        {
          "@id": "https://semiceu.github.io/OOTS/ProofOfDisabilityOfParent/releases/0.0.1/#ProofOfDisabilityOfParentShape/a1a3687dfd67b970152ccfb8ad35cbd4aac70453",
          "rdfs:seeAlso": "https://semiceu.github.io/OOTS/ProofOfDisabilityOfParent/releases/0.0.1/#Proofofdisabilityofparent.isAbout",
          "sh:description": {
            "en": "Agent that is the subject in the provided Evidence."
          },
          "sh:minCount": "1",
          "sh:name": {
            "en": "isAbout"
          },
          "sh:path": "http://purl.org/dc/terms/subject"
        },
        {
          "@id": "https://semiceu.github.io/OOTS/ProofOfDisabilityOfParent/releases/0.0.1/#ProofOfDisabilityOfParentShape/beb8393c9784afab8ad4fd9d83784b90ef9c2728",
          "rdfs:seeAlso": "https://semiceu.github.io/OOTS/ProofOfDisabilityOfParent/releases/0.0.1/#Proofofdisabilityofparent.isAbout",
          "sh:description": {
            "en": "Agent that is the subject in the provided Evidence."
          },
          "sh:maxCount": "1",
          "sh:name": {
            "en": "isAbout"
          },
          "sh:path": "http://purl.org/dc/terms/subject"
        },
        {
          "@id": "https://semiceu.github.io/OOTS/ProofOfDisabilityOfParent/releases/0.0.1/#ProofOfDisabilityOfParentShape/dd3dc38a0c9cd2f98fe5efb2fc7e9ccffcc486bf",
          "rdfs:seeAlso": "https://semiceu.github.io/OOTS/ProofOfDisabilityOfParent/releases/0.0.1/#Proofofdisabilityofparent.isAbout",
          "sh:class": "http://www.w3.org/ns/person#Person",
          "sh:description": {
            "en": "Agent that is the subject in the provided Evidence."
          },
          "sh:name": {
            "en": "isAbout"
          },
          "sh:path": "http://purl.org/dc/terms/subject"
        }
      ],
      "sh:targetClass": "http://data.europa.eu/p4s/ProofOfDisabilityOfParent"
    },
    {
      "@id": "https://semiceu.github.io/OOTS/ProofOfDisabilityOfParent/releases/0.0.1/#TextShape",
      "@type": "sh:NodeShape",
      "sh:closed": false,
      "sh:property": [],
      "sh:targetClass": "http://www.w3.org/1999/02/22-rdf-syntax-ns#langString"
    },
    {
      "@id": "https://semiceu.github.io/OOTS/ProofOfDisabilityOfParent/releases/0.0.1/#CodeShape",
      "@type": "sh:NodeShape",
      "sh:closed": false,
      "sh:property": [],
      "sh:targetClass": "http://www.w3.org/2004/02/skos/core#Concept"
    },
    {
      "@id": "https://semiceu.github.io/OOTS/ProofOfDisabilityOfParent/releases/0.0.1/#PersonShape",
      "@type": "sh:NodeShape",
      "sh:closed": false,
      "sh:property": [
        {
          "@id": "https://semiceu.github.io/OOTS/ProofOfDisabilityOfParent/releases/0.0.1/#PersonShape/02385f3b9d1535bd73391c90a820bc54033f8fc6",
          "rdfs:seeAlso": "https://semiceu.github.io/OOTS/ProofOfDisabilityOfParent/releases/0.0.1/#Person.familyname",
          "sh:description": {
            "en": "The hereditary surname of a family."
          },
          "sh:name": {
            "en": "family name"
          },
          "sh:path": "http://xmlns.com/foaf/0.1/familyName",
          "sh:uniqueLang": "true"
        },
        {
          "@id": "https://semiceu.github.io/OOTS/ProofOfDisabilityOfParent/releases/0.0.1/#PersonShape/14911feba2382e7d3aec60a469a199aaa6831622",
          "rdfs:seeAlso": "https://semiceu.github.io/OOTS/ProofOfDisabilityOfParent/releases/0.0.1/#Person.hassibling",
          "sh:description": {
            "en": "Connects a person to one of their parents."
          },
          "sh:name": {
            "en": "has sibling"
          },
          "sh:nodeKind": "sh:BlankNodeOrIRI",
          "sh:path": "http://data.europa.eu/p4s/hasParent"
        },
        {
          "@id": "https://semiceu.github.io/OOTS/ProofOfDisabilityOfParent/releases/0.0.1/#PersonShape/1572a063cf6e42858dabf5017baf40a96bf7155d",
          "rdfs:seeAlso": "https://semiceu.github.io/OOTS/ProofOfDisabilityOfParent/releases/0.0.1/#Person.familyname",
          "sh:datatype": "http://www.w3.org/1999/02/22-rdf-syntax-ns#langString",
          "sh:description": {
            "en": "The hereditary surname of a family."
          },
          "sh:name": {
            "en": "family name"
          },
          "sh:path": "http://xmlns.com/foaf/0.1/familyName"
        },
        {
          "@id": "https://semiceu.github.io/OOTS/ProofOfDisabilityOfParent/releases/0.0.1/#PersonShape/5e2be9057b6f65cdb4cd1623e4981106e0284d69",
          "rdfs:seeAlso": "https://semiceu.github.io/OOTS/ProofOfDisabilityOfParent/releases/0.0.1/#Person.hassibling",
          "sh:class": "http://www.w3.org/ns/person#Person",
          "sh:description": {
            "en": "Connects a person to one of their parents."
          },
          "sh:name": {
            "en": "has sibling"
          },
          "sh:path": "http://data.europa.eu/p4s/hasParent"
        },
        {
          "@id": "https://semiceu.github.io/OOTS/ProofOfDisabilityOfParent/releases/0.0.1/#PersonShape/7349aedd98256d90685571bddc6da8ac9eab1767",
          "rdfs:seeAlso": "https://semiceu.github.io/OOTS/ProofOfDisabilityOfParent/releases/0.0.1/#Person.givenname",
          "sh:description": {
            "en": "The name(s) that identify the Person within a family with a common surname."
          },
          "sh:name": {
            "en": "given name"
          },
          "sh:nodeKind": "sh:Literal",
          "sh:path": "http://xmlns.com/foaf/0.1/givenName"
        },
        {
          "@id": "https://semiceu.github.io/OOTS/ProofOfDisabilityOfParent/releases/0.0.1/#PersonShape/7d0aad3aaae427f799249eafced4cbb0b8a36dc5",
          "rdfs:seeAlso": "https://semiceu.github.io/OOTS/ProofOfDisabilityOfParent/releases/0.0.1/#Person.familyname",
          "sh:description": {
            "en": "The hereditary surname of a family."
          },
          "sh:name": {
            "en": "family name"
          },
          "sh:nodeKind": "sh:Literal",
          "sh:path": "http://xmlns.com/foaf/0.1/familyName"
        },
        {
          "@id": "https://semiceu.github.io/OOTS/ProofOfDisabilityOfParent/releases/0.0.1/#PersonShape/b9da0bb511b75552c4edec2383d2c9ebb35f0774",
          "rdfs:seeAlso": "https://semiceu.github.io/OOTS/ProofOfDisabilityOfParent/releases/0.0.1/#Person.dateofbirth",
          "sh:description": {
            "en": "The point in time on which the Person was born."
          },
          "sh:name": {
            "en": "date of birth"
          },
          "sh:nodeKind": "sh:Literal",
          "sh:path": "http://data.europa.eu/m8g/birthDate"
        },
        {
          "@id": "https://semiceu.github.io/OOTS/ProofOfDisabilityOfParent/releases/0.0.1/#PersonShape/ba21b6c4a9251ed67b6b3113dc1d857640fd4534",
          "rdfs:seeAlso": "https://semiceu.github.io/OOTS/ProofOfDisabilityOfParent/releases/0.0.1/#Person.givenname",
          "sh:description": {
            "en": "The name(s) that identify the Person within a family with a common surname."
          },
          "sh:name": {
            "en": "given name"
          },
          "sh:path": "http://xmlns.com/foaf/0.1/givenName",
          "sh:uniqueLang": "true"
        },
        {
          "@id": "https://semiceu.github.io/OOTS/ProofOfDisabilityOfParent/releases/0.0.1/#PersonShape/f888a185270cac3f6e32d6e1a22eb6a89d617ba8",
          "rdfs:seeAlso": "https://semiceu.github.io/OOTS/ProofOfDisabilityOfParent/releases/0.0.1/#Person.givenname",
          "sh:datatype": "http://www.w3.org/1999/02/22-rdf-syntax-ns#langString",
          "sh:description": {
            "en": "The name(s) that identify the Person within a family with a common surname."
          },
          "sh:name": {
            "en": "given name"
          },
          "sh:path": "http://xmlns.com/foaf/0.1/givenName"
        }
      ],
      "sh:targetClass": "http://www.w3.org/ns/person#Person"
    }
  ]
}
