{
  "@context": {
    "EvidenceType": "http://data.europa.eu/m8g/EvidenceType",
    "GenericDate": "http://data.europa.eu/m8g/GenericDate",
    "IssueDate": {
      "@container": "@set",
      "@id": "http://purl.org/dc/terms/issued",
      "@type": "http://data.europa.eu/m8g/GenericDate"
    },
    "Jurisdiction": "http://purl.org/dc/terms/Jurisdiction",
    "Person": "http://www.w3.org/ns/person#Person",
    "ProofOfCitizenshipOfParent": "http://data.europa.eu/p4s/ProofOfCitizenshipOfParent",
    "Text": "http://www.w3.org/1999/02/22-rdf-syntax-ns#langString",
    "citizenship": {
      "@container": "@set",
      "@id": "http://www.w3.org/ns/person#citizenship",
      "@type": "@id"
    },
    "dateOfBirth": {
      "@container": "@set",
      "@id": "http://data.europa.eu/m8g/birthDate",
      "@type": "http://data.europa.eu/m8g/GenericDate"
    },
    "familyName": {
      "@container": "@set",
      "@id": "http://xmlns.com/foaf/0.1/familyName",
      "@type": "http://www.w3.org/1999/02/22-rdf-syntax-ns#langString"
    },
    "givenName": {
      "@container": "@set",
      "@id": "http://xmlns.com/foaf/0.1/givenName",
      "@type": "http://www.w3.org/1999/02/22-rdf-syntax-ns#langString"
    },
    "hasParent": {
      "@container": "@set",
      "@id": "http://data.europa.eu/p4s/hasParent",
      "@type": "@id"
    },
    "isAbout": {
      "@id": "http://purl.org/dc/terms/subject",
      "@type": "@id"
    },
    "name": {
      "@container": "@set",
      "@id": "http://www.w3.org/2000/01/rdf-schema#label",
      "@type": "http://www.w3.org/1999/02/22-rdf-syntax-ns#langString"
    }
  }
}
