{
  "@context": {
    "Code": "http://www.w3.org/2004/02/skos/core#Concept",
    "EvidenceType": "http://data.europa.eu/m8g/EvidenceType",
    "GenericDate": "http://data.europa.eu/m8g/GenericDate",
    "Location": "http://purl.org/dc/terms/Location",
    "Person": "http://www.w3.org/ns/person#Person",
    "ProofOfDeathOfSibling": "http://data.europa.eu/p4s/ProofOfDeathOfSibling",
    "Text": "http://www.w3.org/1999/02/22-rdf-syntax-ns#langString",
    "countryOfDeath": {
      "@container": "@set",
      "@id": "http://www.w3.org/ns/person#countryOfDeath",
      "@type": "@id"
    },
    "dateOfBirth": {
      "@container": "@set",
      "@id": "http://data.europa.eu/m8g/birthDate",
      "@type": "http://data.europa.eu/m8g/GenericDate"
    },
    "dateOfDeath": {
      "@id": "http://data.europa.eu/m8g/deathDate",
      "@type": "http://data.europa.eu/m8g/GenericDate"
    },
    "familyName": {
      "@container": "@set",
      "@id": "http://xmlns.com/foaf/0.1/familyName",
      "@type": "http://www.w3.org/1999/02/22-rdf-syntax-ns#langString"
    },
    "geographicName": {
      "@container": "@set",
      "@id": "http://www.w3.org/ns/locn#geographicName",
      "@type": "http://www.w3.org/1999/02/22-rdf-syntax-ns#langString"
    },
    "givenName": {
      "@container": "@set",
      "@id": "http://xmlns.com/foaf/0.1/givenName",
      "@type": "http://www.w3.org/1999/02/22-rdf-syntax-ns#langString"
    },
    "hasSibling": {
      "@container": "@set",
      "@id": "http://data.europa.eu/p4s/hasSibling",
      "@type": "@id"
    },
    "isAbout": {
      "@id": "http://purl.org/dc/terms/subject",
      "@type": "@id"
    },
    "placeOfDeath": {
      "@container": "@set",
      "@id": "http://www.w3.org/ns/person#placeOfDeath",
      "@type": "@id"
    },
    "sex": {
      "@container": "@set",
      "@id": "http://data.europa.eu/m8g/sex",
      "@type": "@id"
    }
  }
}
