{
  "@context": {
    "@vocab": "https://semiceu.github.io/OOTS/ProofOfCitizenshipOfParent/releases/0.0.1/",
    "qb": "http://purl.org/linked-data/cube#",
    "qb:codeList": {
      "@id": "qb:codeList",
      "@type": "@id"
    },
    "rdf": "http://www.w3.org/1999/02/22-rdf-syntax-ns#",
    "rdf:first": {
      "@type": "@id"
    },
    "rdf:rest": {
      "@type": "@id"
    },
    "rdfs": "http://www.w3.org/2000/01/rdf-schema#",
    "rdfs:comment": {
      "@id": "rdfs:comment"
    },
    "sh": "http://www.w3.org/ns/shacl#",
    "sh:and": {
      "@container": "@set",
      "@id": "sh:and",
      "@type": "@id"
    },
    "sh:class": {
      "@id": "sh:class",
      "@type": "@id"
    },
    "sh:datatype": {
      "@id": "sh:datatype",
      "@type": "@id"
    },
    "sh:description": {
      "@container": "@language",
      "@id": "sh:description"
    },
    "sh:hasValue": {
      "@id": "sh:hasValue",
      "@type": "@id"
    },
    "sh:in": {
      "@container": "@set",
      "@id": "sh:in",
      "@type": "@id"
    },
    "sh:maxCount": {
      "@id": "sh:maxCount",
      "@type": "http://www.w3.org/2001/XMLSchema#integer"
    },
    "sh:minCount": {
      "@id": "sh:minCount",
      "@type": "http://www.w3.org/2001/XMLSchema#integer"
    },
    "sh:name": {
      "@container": "@language",
      "@id": "sh:name"
    },
    "sh:node": {
      "@id": "sh:node",
      "@type": "@id"
    },
    "sh:nodeKind": {
      "@id": "sh:nodeKind",
      "@type": "@id"
    },
    "sh:or": {
      "@container": "@set",
      "@id": "sh:or",
      "@type": "@id"
    },
    "sh:path": {
      "@id": "sh:path",
      "@type": "@id"
    },
    "sh:property": {
      "@id": "sh:property",
      "@type": "@id"
    },
    "sh:severity": {
      "@id": "sh:severity",
      "@type": "@id"
    },
    "sh:targetClass": {
      "@id": "sh:targetClass",
      "@type": "@id"
    },
    "sh:uniqueLang": {
      "@id": "sh:uniqueLang",
      "@type": "http://www.w3.org/2001/XMLSchema#boolean"
    },
    "shapes": {
      "@id": "rdfs:member",
      "@type": "@id"
    },
    "skos": "http://www.w3.org/2004/02/skos/core#",
    "vl": "https://purl.eu/ns/shacl#",
    "vl:message": {
      "@container": "@language",
      "@id": "vl:message"
    }
  },
  "@id": "https://semiceu.github.io/OOTS/ProofOfCitizenshipOfParent/releases/0.0.1/",
  "shapes": [
    {
      "@id": "https://semiceu.github.io/OOTS/ProofOfCitizenshipOfParent/releases/0.0.1/#EvidenceTypeShape",
      "@type": "sh:NodeShape",
      "sh:closed": false,
      "sh:property": [],
      "sh:targetClass": "http://data.europa.eu/m8g/EvidenceType"
    },
    {
      "@id": "https://semiceu.github.io/OOTS/ProofOfCitizenshipOfParent/releases/0.0.1/#GenericDateShape",
      "@type": "sh:NodeShape",
      "sh:closed": false,
      "sh:property": [],
      "sh:targetClass": "http://data.europa.eu/m8g/GenericDate"
    },
    {
      "@id": "https://semiceu.github.io/OOTS/ProofOfCitizenshipOfParent/releases/0.0.1/#ProofOfCitizenshipOfParentShape",
      "@type": "sh:NodeShape",
      "sh:closed": false,
      "sh:property": [
        {
          "@id": "https://semiceu.github.io/OOTS/ProofOfCitizenshipOfParent/releases/0.0.1/#ProofOfCitizenshipOfParentShape/20dd2753b73d4f7eccdaf00a2c473caeac093f1f",
          "rdfs:seeAlso": "https://semiceu.github.io/OOTS/ProofOfCitizenshipOfParent/releases/0.0.1/#Proofofcitizenshipofparent.DateIssued",
          "sh:description": {
            "en": "Date of formal issuance of the resource."
          },
          "sh:name": {
            "en": "Date Issued"
          },
          "sh:nodeKind": "sh:Literal",
          "sh:path": "http://purl.org/dc/terms/issued"
        },
        {
          "@id": "https://semiceu.github.io/OOTS/ProofOfCitizenshipOfParent/releases/0.0.1/#ProofOfCitizenshipOfParentShape/2dce9b18efee12654d57d620e560b98866939a09",
          "rdfs:seeAlso": "https://semiceu.github.io/OOTS/ProofOfCitizenshipOfParent/releases/0.0.1/#Proofofcitizenshipofparent.isabout",
          "sh:description": {
            "en": "Agent that is the subject in the provided Evidence."
          },
          "sh:name": {
            "en": "is about"
          },
          "sh:nodeKind": "sh:BlankNodeOrIRI",
          "sh:path": "http://purl.org/dc/terms/subject"
        },
        {
          "@id": "https://semiceu.github.io/OOTS/ProofOfCitizenshipOfParent/releases/0.0.1/#ProofOfCitizenshipOfParentShape/81cc0ae833ea6f13aaaa73620b37f37ec5c500b6",
          "rdfs:seeAlso": "https://semiceu.github.io/OOTS/ProofOfCitizenshipOfParent/releases/0.0.1/#Proofofcitizenshipofparent.isabout",
          "sh:description": {
            "en": "Agent that is the subject in the provided Evidence."
          },
          "sh:minCount": "1",
          "sh:name": {
            "en": "is about"
          },
          "sh:path": "http://purl.org/dc/terms/subject"
        },
        {
          "@id": "https://semiceu.github.io/OOTS/ProofOfCitizenshipOfParent/releases/0.0.1/#ProofOfCitizenshipOfParentShape/dd5acd5f2a95b2d54489e871f39a1756b0157962",
          "rdfs:seeAlso": "https://semiceu.github.io/OOTS/ProofOfCitizenshipOfParent/releases/0.0.1/#Proofofcitizenshipofparent.isabout",
          "sh:description": {
            "en": "Agent that is the subject in the provided Evidence."
          },
          "sh:maxCount": "1",
          "sh:name": {
            "en": "is about"
          },
          "sh:path": "http://purl.org/dc/terms/subject"
        },
        {
          "@id": "https://semiceu.github.io/OOTS/ProofOfCitizenshipOfParent/releases/0.0.1/#ProofOfCitizenshipOfParentShape/ef5e8b6c5a21c44b1ee5c98c4246fc32995a7e2c",
          "rdfs:seeAlso": "https://semiceu.github.io/OOTS/ProofOfCitizenshipOfParent/releases/0.0.1/#Proofofcitizenshipofparent.isabout",
          "sh:class": "http://www.w3.org/ns/person#Person",
          "sh:description": {
            "en": "Agent that is the subject in the provided Evidence."
          },
          "sh:name": {
            "en": "is about"
          },
          "sh:path": "http://purl.org/dc/terms/subject"
        }
      ],
      "sh:targetClass": "http://data.europa.eu/p4s/ProofOfCitizenshipOfParent"
    },
    {
      "@id": "https://semiceu.github.io/OOTS/ProofOfCitizenshipOfParent/releases/0.0.1/#JurisdictionShape",
      "@type": "sh:NodeShape",
      "sh:closed": false,
      "sh:property": [
        {
          "@id": "https://semiceu.github.io/OOTS/ProofOfCitizenshipOfParent/releases/0.0.1/#JurisdictionShape/263a563c5bed08cdaadf4a0fd0a5fb9874d742bc",
          "rdfs:seeAlso": "https://semiceu.github.io/OOTS/ProofOfCitizenshipOfParent/releases/0.0.1/#Jurisdiction.name",
          "sh:datatype": "http://www.w3.org/1999/02/22-rdf-syntax-ns#langString",
          "sh:description": {
            "en": "A string of characters that represents a Jurisdiction."
          },
          "sh:name": {
            "en": "name"
          },
          "sh:path": "http://www.w3.org/2000/01/rdf-schema#label"
        },
        {
          "@id": "https://semiceu.github.io/OOTS/ProofOfCitizenshipOfParent/releases/0.0.1/#JurisdictionShape/9caf9e629daa0e64ece77788576468821d7cff8c",
          "rdfs:seeAlso": "https://semiceu.github.io/OOTS/ProofOfCitizenshipOfParent/releases/0.0.1/#Jurisdiction.name",
          "sh:description": {
            "en": "A string of characters that represents a Jurisdiction."
          },
          "sh:name": {
            "en": "name"
          },
          "sh:nodeKind": "sh:Literal",
          "sh:path": "http://www.w3.org/2000/01/rdf-schema#label"
        },
        {
          "@id": "https://semiceu.github.io/OOTS/ProofOfCitizenshipOfParent/releases/0.0.1/#JurisdictionShape/be01df43f1c288b656b3ca3879eb3dd9d8c700b9",
          "rdfs:seeAlso": "https://semiceu.github.io/OOTS/ProofOfCitizenshipOfParent/releases/0.0.1/#Jurisdiction.name",
          "sh:description": {
            "en": "A string of characters that represents a Jurisdiction."
          },
          "sh:name": {
            "en": "name"
          },
          "sh:path": "http://www.w3.org/2000/01/rdf-schema#label",
          "sh:uniqueLang": "true"
        }
      ],
      "sh:targetClass": "http://purl.org/dc/terms/Jurisdiction"
    },
    {
      "@id": "https://semiceu.github.io/OOTS/ProofOfCitizenshipOfParent/releases/0.0.1/#TextShape",
      "@type": "sh:NodeShape",
      "sh:closed": false,
      "sh:property": [],
      "sh:targetClass": "http://www.w3.org/1999/02/22-rdf-syntax-ns#langString"
    },
    {
      "@id": "https://semiceu.github.io/OOTS/ProofOfCitizenshipOfParent/releases/0.0.1/#PersonShape",
      "@type": "sh:NodeShape",
      "sh:closed": false,
      "sh:property": [
        {
          "@id": "https://semiceu.github.io/OOTS/ProofOfCitizenshipOfParent/releases/0.0.1/#PersonShape/02385f3b9d1535bd73391c90a820bc54033f8fc6",
          "rdfs:seeAlso": "https://semiceu.github.io/OOTS/ProofOfCitizenshipOfParent/releases/0.0.1/#Person.familyname",
          "sh:description": {
            "en": "The hereditary surname of a family."
          },
          "sh:name": {
            "en": "family name"
          },
          "sh:path": "http://xmlns.com/foaf/0.1/familyName",
          "sh:uniqueLang": "true"
        },
        {
          "@id": "https://semiceu.github.io/OOTS/ProofOfCitizenshipOfParent/releases/0.0.1/#PersonShape/1572a063cf6e42858dabf5017baf40a96bf7155d",
          "rdfs:seeAlso": "https://semiceu.github.io/OOTS/ProofOfCitizenshipOfParent/releases/0.0.1/#Person.familyname",
          "sh:datatype": "http://www.w3.org/1999/02/22-rdf-syntax-ns#langString",
          "sh:description": {
            "en": "The hereditary surname of a family."
          },
          "sh:name": {
            "en": "family name"
          },
          "sh:path": "http://xmlns.com/foaf/0.1/familyName"
        },
        {
          "@id": "https://semiceu.github.io/OOTS/ProofOfCitizenshipOfParent/releases/0.0.1/#PersonShape/17753da6f4f2354f710c8038acdf91bd263e20a4",
          "rdfs:seeAlso": "https://semiceu.github.io/OOTS/ProofOfCitizenshipOfParent/releases/0.0.1/#Person.citizenship",
          "sh:description": {
            "en": "\tThe Jurisdiction that has conferred citizenship rights on the Person such as the right to vote, to receive certain protection from the community or the issuance of a passport."
          },
          "sh:name": {
            "en": "citizenship"
          },
          "sh:nodeKind": "sh:BlankNodeOrIRI",
          "sh:path": "http://www.w3.org/ns/person#citizenship"
        },
        {
          "@id": "https://semiceu.github.io/OOTS/ProofOfCitizenshipOfParent/releases/0.0.1/#PersonShape/706e2781216d4f5d5f6224180be0ad6f8b118873",
          "rdfs:seeAlso": "https://semiceu.github.io/OOTS/ProofOfCitizenshipOfParent/releases/0.0.1/#Person.hasparent",
          "sh:description": {
            "en": "Connects a person to one of their parents."
          },
          "sh:name": {
            "en": "has parent"
          },
          "sh:nodeKind": "sh:BlankNodeOrIRI",
          "sh:path": "http://data.europa.eu/p4s/hasParent"
        },
        {
          "@id": "https://semiceu.github.io/OOTS/ProofOfCitizenshipOfParent/releases/0.0.1/#PersonShape/7349aedd98256d90685571bddc6da8ac9eab1767",
          "rdfs:seeAlso": "https://semiceu.github.io/OOTS/ProofOfCitizenshipOfParent/releases/0.0.1/#Person.givenname",
          "sh:description": {
            "en": "The name(s) that identify the Person within a family with a common surname."
          },
          "sh:name": {
            "en": "given name"
          },
          "sh:nodeKind": "sh:Literal",
          "sh:path": "http://xmlns.com/foaf/0.1/givenName"
        },
        {
          "@id": "https://semiceu.github.io/OOTS/ProofOfCitizenshipOfParent/releases/0.0.1/#PersonShape/7d0aad3aaae427f799249eafced4cbb0b8a36dc5",
          "rdfs:seeAlso": "https://semiceu.github.io/OOTS/ProofOfCitizenshipOfParent/releases/0.0.1/#Person.familyname",
          "sh:description": {
            "en": "The hereditary surname of a family."
          },
          "sh:name": {
            "en": "family name"
          },
          "sh:nodeKind": "sh:Literal",
          "sh:path": "http://xmlns.com/foaf/0.1/familyName"
        },
        {
          "@id": "https://semiceu.github.io/OOTS/ProofOfCitizenshipOfParent/releases/0.0.1/#PersonShape/b9da0bb511b75552c4edec2383d2c9ebb35f0774",
          "rdfs:seeAlso": "https://semiceu.github.io/OOTS/ProofOfCitizenshipOfParent/releases/0.0.1/#Person.dateofbirth",
          "sh:description": {
            "en": "The point in time on which the Person was born."
          },
          "sh:name": {
            "en": "date of birth"
          },
          "sh:nodeKind": "sh:Literal",
          "sh:path": "http://data.europa.eu/m8g/birthDate"
        },
        {
          "@id": "https://semiceu.github.io/OOTS/ProofOfCitizenshipOfParent/releases/0.0.1/#PersonShape/ba21b6c4a9251ed67b6b3113dc1d857640fd4534",
          "rdfs:seeAlso": "https://semiceu.github.io/OOTS/ProofOfCitizenshipOfParent/releases/0.0.1/#Person.givenname",
          "sh:description": {
            "en": "The name(s) that identify the Person within a family with a common surname."
          },
          "sh:name": {
            "en": "given name"
          },
          "sh:path": "http://xmlns.com/foaf/0.1/givenName",
          "sh:uniqueLang": "true"
        },
        {
          "@id": "https://semiceu.github.io/OOTS/ProofOfCitizenshipOfParent/releases/0.0.1/#PersonShape/bf74cccfec7e50f438b22e22a005bb1546874a66",
          "rdfs:seeAlso": "https://semiceu.github.io/OOTS/ProofOfCitizenshipOfParent/releases/0.0.1/#Person.citizenship",
          "sh:class": "http://purl.org/dc/terms/Jurisdiction",
          "sh:description": {
            "en": "\tThe Jurisdiction that has conferred citizenship rights on the Person such as the right to vote, to receive certain protection from the community or the issuance of a passport."
          },
          "sh:name": {
            "en": "citizenship"
          },
          "sh:path": "http://www.w3.org/ns/person#citizenship"
        },
        {
          "@id": "https://semiceu.github.io/OOTS/ProofOfCitizenshipOfParent/releases/0.0.1/#PersonShape/cb7f2ebb09a3f931dae42ed5bae332f5ca46b956",
          "rdfs:seeAlso": "https://semiceu.github.io/OOTS/ProofOfCitizenshipOfParent/releases/0.0.1/#Person.hasparent",
          "sh:class": "http://www.w3.org/ns/person#Person",
          "sh:description": {
            "en": "Connects a person to one of their parents."
          },
          "sh:name": {
            "en": "has parent"
          },
          "sh:path": "http://data.europa.eu/p4s/hasParent"
        },
        {
          "@id": "https://semiceu.github.io/OOTS/ProofOfCitizenshipOfParent/releases/0.0.1/#PersonShape/f888a185270cac3f6e32d6e1a22eb6a89d617ba8",
          "rdfs:seeAlso": "https://semiceu.github.io/OOTS/ProofOfCitizenshipOfParent/releases/0.0.1/#Person.givenname",
          "sh:datatype": "http://www.w3.org/1999/02/22-rdf-syntax-ns#langString",
          "sh:description": {
            "en": "The name(s) that identify the Person within a family with a common surname."
          },
          "sh:name": {
            "en": "given name"
          },
          "sh:path": "http://xmlns.com/foaf/0.1/givenName"
        }
      ],
      "sh:targetClass": "http://www.w3.org/ns/person#Person"
    }
  ]
}
