{"settings": {
    "index":{
        "number_of_shards": 10,
        "number_of_replicas": 0,
        "refresh_interval": "21600s",
        "translog.flush_threshold_size" : "4096MB",
         "knn": true
         }
  },
"mappings":
    {"properties":
      {"@timestamp":{"type":"date"}
      ,"@version":{"type":"text","fields":{"keyword":{"type":"keyword","ignore_above":256}}}
      ,"crc_data_mapping": {"type": "text", "fields": {"keyword": {"type": "keyword", "ignore_above": 256}}}
      ,"date":{"type":"date"}
      ,"source":{"type":"text","fields":{"keyword":{"type":"keyword","ignore_above":256}}}

      ,"author":{"type":"text","fields":{"keyword":{"type":"keyword","ignore_above":256}}}
      ,"title":{"type":"text","fields":{"keyword":{"type":"keyword","ignore_above":256}}}
      ,"abstract":{"type":"text","fields":{"keyword":{"type":"keyword","ignore_above":256}}}

      ,"keywords":{"type":"nested","dynamic":"false","properties":{"keyword":{"type":"keyword"}
                                                                  ,"score":{"type":"double"}}}

      ,"chunk_number":{"type":"integer"}
      ,"chunk_text":{"type":"text","fields":{"keyword":{"type":"keyword","ignore_above":256}}}

      ,"document_id":{"type":"keyword"}
      ,"id":{"type":"text","fields":{"keyword":{"type":"keyword","ignore_above":256}}}
      ,"id_alias":{"type":"text","fields":{"keyword":{"type":"keyword","ignore_above":256}}}

      ,"collection":{"type":"keyword","fields":{"keyword":{"type":"keyword","ignore_above":256}}}
      ,"reference":{"type":"text","fields":{"keyword":{"type":"keyword","ignore_above":256}}}
      ,"in_force":{"type":"text","fields":{"keyword":{"type":"keyword","ignore_above":256}}}

      ,"language":{"type":"text","fields":{"keyword":{"type":"keyword","ignore_above":256}}}
      ,"link_alias":{"type":"text","fields":{"keyword":{"type":"keyword","ignore_above":256}}}
      ,"link_origin":{"type":"text","fields":{"keyword":{"type":"keyword","ignore_above":256}}}
      ,"link_reference":{"type":"text","fields":{"keyword":{"type":"keyword","ignore_above":256}}}
      ,"link_related":{"type":"text","fields":{"keyword":{"type":"keyword","ignore_above":256}}}
      ,"mime_type":{"type":"text","fields":{"keyword":{"type":"keyword","ignore_above":256}}}
      ,"taxonomy":{"type":"keyword","fields":{"keyword":{"type":"keyword"}}}
      ,"sbert_embedding":{"type": "knn_vector", "dimension": 1024, "method": {
                "name": "hnsw", 
                "space_type": "innerproduct", 
                "engine": "faiss",
                "parameters": {"ef_search": 128, 
                                               "ef_construction": 256,
                                               "encoder": {
                                                         "name": "sq",
                                                         "parameters": {
                                                                "type": "fp16"
                                                        }
                                               },
                                               "m": 32}}}
      ,"other":{"type":"flat_object"}
      ,"annotation":{"type":"text","fields":{"keyword":{"type":"keyword"}}}
}}}
