{
  "/public": {
    "target": "http://localhost:9000",
    "secure": false,
    "changeOrigin": true
  },
  "/auth": {
    "target": "http://localhost:9000",
    "secure": false,
    "changeOrigin": true
  },
  "/upload": {
    "target": "http://localhost:8082",
    "secure": false,
    "changeOrigin": true
  }
}
