{
  "name": "confirm-dialog",
  "$schema": "../../../node_modules/nx/schemas/project-schema.json",
  "sourceRoot": "libs/shared-ui/confirm-dialog/src",
  "prefix": "lib",
  "projectType": "library",
  "tags": [],
  "targets": {
    "test": {
      "executor": "@nx/jest:jest",
      "outputs": ["{workspaceRoot}/coverage/{projectRoot}"],
      "options": {
        "jestConfig": "libs/shared-ui/confirm-dialog/jest.config.ts"
      }
    },
    "lint": {
      "executor": "@nx/eslint:lint"
    }
  }
}
