{
  "General Service Properties - Name": "PSO",
  "General Service Properties - Description": "PSO Data Offering",
  "General Service Properties - Service Access Point": "http://psoserviceaccesspoint.com",
  "General Service Properties - In Language": "en",
  "Data Properties - Format": "json",
  "Provider Information - Provided By": "PSO",
  "Provider Information - Contact": "pso@test.com",
  "Provider Information - Signature": "PSO",
  "Offering Price - License": "https://psolicense.com",
  "Offering Price - Currency": "EUR",
  "Offering Price - Price": "0",
  "Offering Price - Price Type": "free",
  "Service Policy - Access Policy": "Free",
  "Service Policy - Usage Policy": "Free",
  "Service Policy - Data Protection Regime": "Test Regime",
  "Contract Template Document": "Contract Template 1",
  "Billing Schema Document": "Billing Schema 1",
  "SLA Agreements Document": "Sla Agreements 1"
}