{
  "name": "onboarding-e2e",
  "$schema": "../../node_modules/nx/schemas/project-schema.json",
  "projectType": "application",
  "sourceRoot": "apps/onboarding-e2e/src",
  "tags": [],
  "implicitDependencies": ["onboarding"],
  "// targets": "to see all targets run: nx show project onboarding-e2e --web",
  "targets": {}
}
