CompanyName,DelistedDate,RelistedDate
d2fbad2159c17d84ac5ecae1f0ac9985b319a6d088742c8d66e0f9d8a8287e77,2016-06-27 00:00:00,2003-12-12 00:00:00
f704bc6fe911d23d18829c7147fc4127466fbdef3b12e59ff89f50989671611f,2008-05-21 00:00:00,2003-07-09 00:00:00
2525b6a3d2f97e2a1245e7e8994f95a456fb7c76c2ea85de9beaa7e5b620aef5,2013-02-07 00:00:00,1999-04-09 00:00:00
063878eb97e10d68c128e80655db673fa0439cca7cf13fa7ef59dd9e982f2cf8,2016-07-25 00:00:00,1962-06-30 00:00:00
d08d72c9bd690d6e7f63e475ace1f417ed9a7808054d770db867461e84381ff4,2023-03-06 00:00:00,1966-01-01 00:00:00
35f15c8df694fccb01fedc7934b0f0860eb109a5acaa06c6c4d8e4340770588c,2008-04-09 00:00:00,2005-04-29 00:00:00
89d40f5f4bf71aa2f22e3bc3f62d886b8157d97ba1c4df7cd034aa0e6b0097a7,2006-09-14 00:00:00,1994-05-09 00:00:00
13ea32fb6923b45ba47d5d5361401a52dd1c4667360445e43a75a1aadd57f81c,2021-06-18 00:00:00,2019-04-12 00:00:00
57a51c4055e6d8192ed9029871139529c78361cacb71e573084d2088f6ec4d15,2011-01-13 00:00:00,2000-05-05 00:00:00
07051c8873c4c858ed500135bbd29233ae9032bc0f4a8c7071938e89e7e5753c,2010-08-27 00:00:00,1977-09-01 00:00:00
528464d76b39f16df250c6cd70b5ba3037286dd491f8bb90b80b407060f05ccf,2013-01-28 00:00:00,1998-08-03 00:00:00
ad85dd0ca6e902c75c78075e1062cc6fd3c739a308326dbad61c01123f640cab,2018-11-28 00:00:00,1997-10-29 00:00:00
3516e79ee35d9e31c67e8d05221ad7df9161e11a93ff994c7a8a77e8671e666f,2022-03-01 00:00:00,1993-11-11 00:00:00
18d64b5cf9be77a9925944ff66c7986ca5f0680bc688dd35a18f5342deaa553d,2022-01-12 00:00:00,2008-05-09 00:00:00
df5ffefcf5e262de1cb84314de040f601b1aa86e51814cad06cbc0b219294975,2021-05-24 00:00:00,2013-07-08 00:00:00
947102ecab24fbb2636fa1c2a35f6b2e5e4e05efb21e03052c7726588ad30167,2013-03-13 00:00:00,2007-07-02 00:00:00
fa72b00b37139b3cbcdaefd26cf26141eaa187b6361021198633653bca62bb11,2023-07-03 00:00:00,2006-06-26 00:00:00
79c52f6d98a08c8b3a3b7eefba96b90cc47e087b312d4f72bc9db26afaf40159,2010-07-06 00:00:00,1998-02-02 00:00:00
8fcbb8303dadfa5e8e706cdcd3cc45c9125fbc91da1b0055ef1c903fa1754c17,2004-03-02 00:00:00,1997-12-10 00:00:00
0f7946d5100d20511e8903c769352c099412640aa378fbb8bda922a12371b96b,2023-06-16 00:00:00,2004-10-28 00:00:00
9521be2ee64f9802a48486e724b1b73b9d46519db0e9e67638515cdbc2a96c57,2003-03-14 00:00:00,2001-01-30 00:00:00
707c33c598dd22aa41e6c705389dbfd03807f797dc54e7e86a22f20100571ed2,2008-04-07 00:00:00,2004-10-14 00:00:00
244190927bfa0c84673ba2784b62ff6dac24b3af71242e7ccf9f5b3246368476,2021-06-23 00:00:00,2013-06-07 00:00:00
1642c7afe1664bb8a5bb97e60fd2e339839fe9a69051cdd8f1356cebb8204c27,2010-09-24 00:00:00,2004-11-24 00:00:00
495dc6dc44539468a8ac6f5e05285eb00a0106feb750b2d50f904cedca85a397,2002-10-29 00:00:00,1996-11-07 00:00:00
ffbdd982e0e4b3c0efb6cd1f3d267edcb861945d4e1b7124de0ff3717d20df37,2011-01-07 00:00:00,2001-06-12 00:00:00
dc557113dc7840a724f771e04fcd0c446f6fbb5cb03c2df08f95ca3412cbca32,2021-06-04 00:00:00,1994-06-09 00:00:00
87a65003a882ce36f97627fdbaa8bff5e15a92856ce466c1caa9ef6082246e25,2019-10-21 00:00:00,1987-01-01 00:00:00
f80867b17959cf801ade9376d029824ddf6fefa01e145839a201a4ad94983a26,2014-10-20 00:00:00,2000-09-14 00:00:00
1ff664999849a2f70d9b57286bce4adc20aaa39dce4a6e17842296a0bb3cb104,2021-10-14 00:00:00,2004-01-30 00:00:00
815219326b2a7af79aade6ab406bbd32332674e8d2410921d0eebef0e0c147bd,2010-07-09 00:00:00,1998-06-16 00:00:00
9a5d22415ed0b13688959ef29c1420a4a0447c31e3d76b21f2ab75a1e309cd22,2004-08-16 00:00:00,1998-11-19 00:00:00
9673c3be69acb775d5cf96b296403d68a5745dbff50d8c86bcb0ac75807381c2,2003-08-27 00:00:00,1999-04-07 00:00:00
d03d86d8c134a9002c97ffcf578717e8ed8de4d3f1f50f372b51b6fdf71b160d,2011-08-16 00:00:00,2006-11-28 00:00:00
3936bb19392c13cc8b5071fc98d00855597337297c13e0a7872f3f04af285780,2021-07-19 00:00:00,1998-11-17 00:00:00
30924dc4bb002f1a2b836acbbdd139a31af12b7180415cc5a6d84cbef89f658f,2018-12-13 00:00:00,1999-10-25 00:00:00
5a4e890a1573244676563003fb80b617425aad972a230b30d9033bc4a6c7aa98,2019-05-07 00:00:00,1998-04-30 00:00:00
5342770a7d2826463d7592e1666bc044dcb7e2a7828fed2e46731a3bddbde171,2017-12-08 00:00:00,1998-09-29 00:00:00
6d8dc256d81471d93aefc88bd7cad62cd241f3d7f96f876797fa8712d163eb31,2011-12-05 00:00:00,2006-12-15 00:00:00
d5eb5e65b95250dd99bcb30a57ac1a2fe8fc17c678b97126b1b641f905ca204e,2015-07-20 00:00:00,2011-12-12 00:00:00
479e232d049cad994d53cced663367de6557927de8e806b390f38413b63ab353,2022-10-18 00:00:00,2006-05-05 00:00:00
f31a22721936f534df67a1b96f81a1b635fc6caef69922bd2987c76feab9a998,2018-09-27 00:00:00,2004-03-03 00:00:00
c21508c5b9366fc19222b095ff6a014377618cb5f349df6845f8f6521f13276f,2012-03-12 00:00:00,2005-06-27 00:00:00
0403ead52243aaa47fc4378b68c26a6b6e458f20722c6d649f3b226942d8a5ce,2022-07-13 00:00:00,2015-06-26 00:00:00
0b0c9902ea2abb0dabbe0563d7331ef08052806c5b0c828c2549677c5dde5472,2016-09-23 00:00:00,2007-07-27 00:00:00
7a5297017682f6aafa8ec22d13342e4528da5315420c83b2224981fd41e380ea,2017-08-11 00:00:00,1998-06-18 00:00:00
47fc7f6c03a04ffdf842e16e6f3281d9873c52d4b8ab263cf45a6001e9ecd176,2021-07-21 00:00:00,2006-12-06 00:00:00
25d3b677c6e7add02aeef39cb18736b6333b3a7d1b8f2681dc32fa678033fe7e,2023-06-08 00:00:00,2005-11-21 00:00:00
39aafe96e696466e4589fb1c36a53ce05364ee6b38712863bce403945f2289f4,2003-03-01 00:00:00,1995-07-10 00:00:00
55de119ea1a2bc7fd9b1e4bdc79307c9915cd46a924a9a3449e6403dc760e3a4,2002-05-24 00:00:00,2001-07-02 00:00:00
126d01f6ddb33e3c1349f1680f163fe24ca2a2d8b6f5759317d85f2a4958fc78,2006-11-06 00:00:00,2002-03-27 00:00:00
798344225a5ec63082eda9f6899ce2447dde325cc03ba781b79532ba1ff25c2d,2006-04-25 00:00:00,2005-03-23 00:00:00
6348044ceb519af91efc837e7c8a6a34c82c958f4b5c5d36cab8f3a24fdbe5b4,2023-01-31 00:00:00,1987-06-30 00:00:00
f8d94ddca59c35ccde8bd708c02b8d58d9bd0d92c2083f616588635ac3df1652,2018-06-05 00:00:00,2007-06-22 00:00:00
fc30123d4a6344cfdc9ecd2daf23b98b87b34565cab35ab889105172e4007c15,2020-04-15 00:00:00,1987-10-20 00:00:00
b4aae30ba7a8134745a2c2fcb31b432c87d0991e226f59711444cf99973541b8,2010-04-01 00:00:00,1989-11-29 00:00:00
c067ec83dc6e644c55e78e6825d847d2f946e96f4d7676ca7cfb2030a4a8d4c1,2017-10-09 00:00:00,2013-11-08 00:00:00
4e3f6c45cd5ff77d3e400fb5059203e522e477ffcf3a772546561a1bbacafe6e,2003-08-04 00:00:00,1999-07-08 00:00:00
100d79c31a8a676da138e8db3df0d9ea9c15085286ef690553fab5663d5e9f62,2019-09-24 00:00:00,1912-02-22 00:00:00
d786c54bb3a7900f778140a985fbbab809d2b8d127d552ffaa8b232cc2e55bd3,2010-10-01 00:00:00,1990-11-26 00:00:00
ce4df9eec5131e8e21df006c97c2a399587025c34b64a51188c11fb018398421,2019-11-08 00:00:00,1996-12-27 00:00:00
9303a8466c905eebd7262a1695c5921c1f795c32d938a1fd41f246ab1a7a939b,2017-12-11 00:00:00,1967-06-29 00:00:00
a3b0071f4b9a0688848583eea1ea851613d8f9c7c2e88b7a037d79023973f9c9,2021-07-30 00:00:00,2007-01-02 00:00:00
ea8c4b8d66b828e30d576ac5a78409afbcddae1c77e2cda5205f98554d37166a,2008-07-29 00:00:00,1998-12-11 00:00:00
37037c25cc5019b54c6e0b59569e98180db35aebc778edcf7951b84e231b7f9e,2019-03-05 00:00:00,2000-12-04 00:00:00
aa9373ce0d9bdd4ab5705ee6726cdd524a2b1e45699b99a006dce8a3ff01d67a,2019-01-30 00:00:00,2006-03-29 00:00:00
64678b9359058ac3376f3ba1ea8f7c62883866650a671afc0e2635bd4dbdd4c6,2019-03-05 00:00:00,2005-10-06 00:00:00
a436814093087e3f45016c837c7143b141191af749be83914d006566c49e4414,2007-11-01 00:00:00,1996-02-05 00:00:00
3afea2a779b05ab7070abe15256305d46a2b32e3f37221b3133b04dcc0ac1d9c,2021-10-06 00:00:00,2017-03-15 00:00:00
552e7f14a3e99e87ae17d1a2089c278927eb27d25541555dd4fa6d30e66a259b,2022-01-14 00:00:00,2013-04-18 00:00:00
10594e614f68bd9e795e8e1d87c631743aa9a2afee9a3c38c7c76b77e015cb9a,2001-05-15 00:00:00,1984-01-01 00:00:00
95465b3a73ddc21b1156edc9b839a0b0faade6963e888850976d63cbfd184362,2023-05-31 00:00:00,1989-10-02 00:00:00
338dde50e4a95387e9211872448b467fb095f7c2e61d2796581ed3953646839d,2015-04-17 00:00:00,1997-06-03 00:00:00
a712e86cd57608b2c6bb3ad9c58ab080ace28cae0b5830d66878e01c3f239705,2022-11-09 00:00:00,1986-01-01 00:00:00
0901f46710d79e6c665e5aaf4e184b4d0fbaef144480b5105fa3fd8795a316e0,2021-05-25 00:00:00,1992-04-07 00:00:00
1cc2cca197a88adcdaa20936d50ec4c63ced212bfc8fa0b734e36b224a3df9f1,2006-08-07 00:00:00,1954-10-25 00:00:00
10f99b05322bebb567f861d0d01cae0d580b72929d4650d465851917118baf52,2022-01-10 00:00:00,2015-02-06 00:00:00
72f9086f52f720ae4a1db5f315b7d342d3d424ff4372cec9346fa2833a11c7c0,2022-11-18 00:00:00,2005-09-23 00:00:00
c698cbca4c7735ac1cf2874045a4ade20fde260cbb09ce2e970e196814a21297,2018-04-03 00:00:00,2004-12-20 00:00:00
362e832812b812e8a80193a34acd18d4205cacd1d90cd73bb76bb5cd1e1a503c,2017-09-29 00:00:00,1998-02-17 00:00:00
ffe4ff52b204ab725c863c930493b14ccc3ebd2706d0d1dc001980c026a3380c,2012-06-25 00:00:00,1996-11-21 00:00:00
fd86e95bc09b70cff61cebc50592fd0050ebc09d7bec6ac43f946e2c00094891,2023-03-24 00:00:00,1996-01-01 00:00:00
824dfb896ae6f4246841ee77225b12f03de3f4c7260b381ff897452cb9d61f56,2021-12-28 00:00:00,2005-12-08 00:00:00
ef5718578112e19d12cdb96e070775c66a0eedebb69b39f3b39d4f8da73fe4ca,2014-06-06 00:00:00,1996-04-01 00:00:00
5603b9c8e16c9a4101bb41fd23adb5705ba0190d2f1ed03699f08de18daf47b4,2019-01-11 00:00:00,1998-06-02 00:00:00
fdfadd77955eea795cd5fad8332e406fbf0f8a7eb490750875e6d8ea98e279f5,2021-06-23 00:00:00,1997-12-22 00:00:00
9441e980765d9864c0d9ac884b4261004e05963fad86bc740edc59d8928369dc,2002-08-16 00:00:00,1995-07-04 00:00:00
a067e5020ee57a021a5a0a207e461682b46e293cbf899538db34e4f24f84281e,2015-04-02 00:00:00,1998-06-11 00:00:00
cf01dc39c60676d2ea89e0840e50f46f5f3a6aafaa0703fa8efa30ea7e7519ac,2003-03-03 00:00:00,2001-11-21 00:00:00
60fa90d6f3ffad15b6f57a9c8f0acdc1d87ec724fd2f682131b5a4378d9d2033,2011-04-19 00:00:00,2007-12-21 00:00:00
112191d8613a2b546dce51a5578888f390166befd52d16c6868e28c1b6a6492a,2022-02-18 00:00:00,2008-07-22 00:00:00
