<?xml version="1.0" encoding="UTF-8" standalone="no"?>
<!-- Created with Inkscape (http://www.inkscape.org/) -->

<svg
   xmlns:dc="http://purl.org/dc/elements/1.1/"
   xmlns:cc="http://creativecommons.org/ns#"
   xmlns:rdf="http://www.w3.org/1999/02/22-rdf-syntax-ns#"
   xmlns:svg="http://www.w3.org/2000/svg"
   xmlns="http://www.w3.org/2000/svg"
   xmlns:sodipodi="http://sodipodi.sourceforge.net/DTD/sodipodi-0.dtd"
   xmlns:inkscape="http://www.inkscape.org/namespaces/inkscape"
   width="23.509333mm"
   height="8.0808182mm"
   viewBox="0 0 83.300785 28.63282"
   id="svg4160"
   version="1.1"
   inkscape:version="0.91 r13725"
   sodipodi:docname="Icon_XML_green.svg">
  <defs
     id="defs4162" />
  <sodipodi:namedview
     id="base"
     pagecolor="#ffffff"
     bordercolor="#666666"
     borderopacity="1.0"
     inkscape:pageopacity="0.0"
     inkscape:pageshadow="2"
     inkscape:zoom="1.979899"
     inkscape:cx="33.990078"
     inkscape:cy="-54.986893"
     inkscape:document-units="px"
     inkscape:current-layer="layer1"
     showgrid="false"
     fit-margin-top="0"
     fit-margin-left="0"
     fit-margin-right="0"
     fit-margin-bottom="0"
     inkscape:window-width="1920"
     inkscape:window-height="1018"
     inkscape:window-x="1912"
     inkscape:window-y="-8"
     inkscape:window-maximized="1" />
  <metadata
     id="metadata4165">
    <rdf:RDF>
      <cc:Work
         rdf:about="">
        <dc:format>image/svg+xml</dc:format>
        <dc:type
           rdf:resource="http://purl.org/dc/dcmitype/StillImage" />
        <dc:title></dc:title>
      </cc:Work>
    </rdf:RDF>
  </metadata>
  <g
     inkscape:label="Layer 1"
     inkscape:groupmode="layer"
     id="layer1"
     transform="translate(-59.285156,-215.2361)">
    <path
       style="fill:#00c000;fill-opacity:1;stroke-width:1"
       inkscape:connector-curvature="0"
       stroke-linecap="Flat"
       stroke-linejoin="Miter"
       id="path4145"
       d="m 59.285156,243.86892 9.785156,-14.94141 -8.867187,-13.69141 6.757812,0 5.742188,9.19922 5.625,-9.19922 6.699219,0 -8.90625,13.90625 9.785156,14.72657 -6.972656,0 -6.347657,-9.90235 -6.367187,9.90235 -6.933594,0 z" />
    <path
       style="fill:#00c000;fill-opacity:1;stroke-width:1"
       inkscape:connector-curvature="0"
       stroke-linecap="Flat"
       stroke-linejoin="Miter"
       id="path4147"
       d="m 88.835937,243.86892 0,-28.63282 8.652344,0 5.195309,19.53125 5.13672,-19.53125 8.67188,0 0,28.63282 -5.3711,0 0,-22.53907 -5.68359,22.53907 -5.566406,0 -5.664063,-22.53907 0,22.53907 -5.371094,0 z" />
    <path
       style="fill:#00c000;fill-opacity:1;stroke-width:1"
       inkscape:connector-curvature="0"
       stroke-linecap="Flat"
       stroke-linejoin="Miter"
       id="path4149"
       d="m 122.42969,243.86892 0,-28.39844 5.78125,0 0,23.57422 14.375,0 0,4.82422 -20.15625,0 z" />
  </g>
</svg>
