﻿Technology                             , fullyelectric , tubing - Heavy Urban , tubing - Urban , tubing - Suburban , tubing - Interurban , tubing - Coach , axle - Heavy Urban , axle - Urban , axle - Suburban , axle - Interurban , axle - Coach , axle - VerificationTest , tubing - VerificationTest
Fixed displacement                     , 0             , 1.00                 , 1.00           , 1.00              , 1.00                , 1.00           , 1.00               , 1.00         , 1.00            , 1.00              , 1.00         , 1.0                     , 1.0
Fixed displacement with elec. control  , 0             , 0.95                 , 0.95           , 0.95              , 0.95                , 0.95           , 1.00               , 1.00         , 1.00            , 1.00              , 1.00         , 1.0                     , 0.95
Dual displacement                      , 0             , 0.85                 , 0.85           , 0.85              , 0.85                , 0.85           , 0.85               , 0.85         , 0.85            , 0.85              , 0.85         , 0.85                    , 0.85
Dual displacement with mech. control   , 0             , 0.85                 , 0.85           , 0.85              , 0.85                , 0.85           , 0.85               , 0.85         , 0.85            , 0.85              , 0.85         , 0.85                    , 0.85
Dual displacement with elec. control   , 0             , 0.80                 , 0.80           , 0.80              , 0.80                , 0.80           , 0.85               , 0.85         , 0.85            , 0.85              , 0.85         , 0.85                    , 0.8
Variable displacement mech. controlled , 0             , 0.75                 , 0.75           , 0.75              , 0.75                , 0.75           , 0.75               , 0.75         , 0.75            , 0.75              , 0.75         , 0.75                    , 0.75
Variable displacement elec. controlled , 0             , 0.60                 , 0.60           , 0.60              , 0.60                , 0.60           , 0.60               , 0.60         , 0.60            , 0.60              , 0.60         , 0.6                     , 0.6
Electric driven pump                   , 1             , 0.25                 , 0.25           , 0.25              , 0.25                , 0.25           , 0.25               , 0.25         , 0.25            , 0.25              , 0.25         , 0.25                    , 0.25
Full electric steering gear            , 1             , 0.00                 , 0.00           , 0.00              , 0.00                , 0.00           , 0.10               , 0.10         , 0.10            , 0.10              , 0.10         , 0.1                     , 0.0