<?xml version="1.0" encoding="UTF-8" standalone="no"?>
<svg
   xmlns:dc="http://purl.org/dc/elements/1.1/"
   xmlns:cc="http://creativecommons.org/ns#"
   xmlns:rdf="http://www.w3.org/1999/02/22-rdf-syntax-ns#"
   xmlns:svg="http://www.w3.org/2000/svg"
   xmlns="http://www.w3.org/2000/svg"
   xmlns:xlink="http://www.w3.org/1999/xlink"
   xmlns:sodipodi="http://sodipodi.sourceforge.net/DTD/sodipodi-0.dtd"
   xmlns:inkscape="http://www.inkscape.org/namespaces/inkscape"
   width="145.87158pt"
   height="41.691467pt"
   viewBox="0 0 145.87158 41.691467"
   version="1.1"
   id="svg2"
   inkscape:version="0.91 r13725"
   sodipodi:docname="GBX-TC2.svg">
  <metadata
     id="metadata185">
    <rdf:RDF>
      <cc:Work
         rdf:about="">
        <dc:format>image/svg+xml</dc:format>
        <dc:type
           rdf:resource="http://purl.org/dc/dcmitype/StillImage" />
        <dc:title></dc:title>
      </cc:Work>
    </rdf:RDF>
  </metadata>
  <sodipodi:namedview
     pagecolor="#ffffff"
     bordercolor="#666666"
     borderopacity="1"
     objecttolerance="10"
     gridtolerance="10"
     guidetolerance="10"
     inkscape:pageopacity="0"
     inkscape:pageshadow="2"
     inkscape:window-width="1366"
     inkscape:window-height="706"
     id="namedview183"
     showgrid="false"
     fit-margin-top="0"
     fit-margin-left="0"
     fit-margin-right="0"
     fit-margin-bottom="0"
     inkscape:zoom="0.34962963"
     inkscape:cx="177.173"
     inkscape:cy="-38.100586"
     inkscape:window-x="-8"
     inkscape:window-y="-8"
     inkscape:window-maximized="1"
     inkscape:current-layer="svg2" />
  <defs
     id="defs4">
    <g
       id="g6">
      <symbol
         overflow="visible"
         id="glyph0-0"
         style="overflow:visible">
        <path
           style="stroke:none"
           d="m 4.15625,-3.5625 0,-0.171875 c 0,-0.101563 0.00391,-0.195313 0.015625,-0.28125 C 4.191406,-4.105469 4.226563,-4.207031 4.28125,-4.3125 4.332031,-4.414063 4.410156,-4.53125 4.515625,-4.65625 4.617188,-4.789063 4.753906,-4.953125 4.921875,-5.140625 5.035156,-5.261719 5.140625,-5.382813 5.234375,-5.5 5.324219,-5.613281 5.40625,-5.734375 5.46875,-5.859375 5.539063,-5.980469 5.59375,-6.113281 5.625,-6.25 5.664063,-6.382813 5.6875,-6.539063 5.6875,-6.71875 5.6875,-7.082031 5.601563,-7.363281 5.4375,-7.5625 5.28125,-7.757813 5.050781,-7.859375 4.75,-7.859375 c -0.15625,0 -0.292969,0.027344 -0.40625,0.078125 -0.117187,0.042969 -0.222656,0.113281 -0.3125,0.203125 -0.085937,0.085937 -0.160156,0.191406 -0.21875,0.3125 C 3.75,-7.148438 3.695313,-7.019531 3.65625,-6.875 l -0.703125,0 0,-0.953125 c 0.289063,-0.144531 0.601563,-0.269531 0.9375,-0.375 0.332031,-0.113281 0.664063,-0.171875 1,-0.171875 0.332031,0 0.617188,0.039062 0.859375,0.109375 0.246094,0.0625 0.445313,0.160156 0.59375,0.28125 0.152344,0.125 0.265625,0.277344 0.328125,0.453125 0.070313,0.167969 0.109375,0.351562 0.109375,0.546875 0,0.1875 -0.023437,0.363281 -0.0625,0.515625 -0.03125,0.148437 -0.097656,0.300781 -0.1875,0.453125 -0.085937,0.148437 -0.199219,0.308594 -0.34375,0.484375 -0.148437,0.167969 -0.332031,0.363281 -0.546875,0.578125 -0.15625,0.15625 -0.285156,0.292969 -0.375,0.40625 C 5.179688,-4.441406 5.113281,-4.339844 5.0625,-4.25 c -0.054687,0.09375 -0.089844,0.195312 -0.109375,0.296875 -0.023437,0.09375 -0.03125,0.210937 -0.03125,0.34375 l 0,0.046875 z m 0.90625,0.796875 0,1.1875 -1.0625,0 0,-1.1875 z m 2.671875,2.078125 0,-8.625 -5.59375,0 0,8.625 z m 0.75,-9.296875 0,9.984375 -7.09375,0 0,-9.984375 z"
           id="path9"
           inkscape:connector-curvature="0" />
      </symbol>
      <symbol
         overflow="visible"
         id="glyph0-1"
         style="overflow:visible">
        <path
           style="stroke:none"
           d="M 4.359375,0 1.28125,0 1.359375,-0.359375 C 1.554688,-0.386719 1.703125,-0.425781 1.796875,-0.46875 1.886719,-0.519531 1.96875,-0.597656 2.03125,-0.703125 2.101563,-0.804688 2.175781,-0.96875 2.25,-1.1875 c 0.070313,-0.214844 0.15625,-0.550781 0.25,-1 l 1.578125,-7.171875 -0.9375,0 c -0.304687,0 -0.550781,0.050781 -0.734375,0.140625 C 2.226563,-9.132813 2.050781,-8.972656 1.875,-8.734375 1.695313,-8.492188 1.476563,-8.089844 1.21875,-7.53125 l -0.703125,0 L 1.0625,-10 l 7.640625,0 -0.5625,2.578125 -0.703125,0 c 0,-0.464844 -0.019531,-0.820313 -0.046875,-1.0625 C 7.367188,-8.722656 7.320313,-8.90625 7.25,-9.03125 7.1875,-9.152344 7.101563,-9.238281 7,-9.28125 6.90625,-9.332031 6.726563,-9.359375 6.46875,-9.359375 l -1.078125,0 -1.59375,7.234375 c -0.042969,0.1875 -0.074219,0.339844 -0.09375,0.453125 -0.011719,0.105469 -0.027344,0.222656 -0.046875,0.34375 -0.011719,0.125 -0.015625,0.242187 -0.015625,0.34375 0,0.148437 0.023438,0.269531 0.078125,0.359375 0.050781,0.085937 0.125,0.148437 0.21875,0.1875 0.101563,0.03125 0.273438,0.058594 0.515625,0.078125 z"
           id="path12"
           inkscape:connector-curvature="0" />
      </symbol>
      <symbol
         overflow="visible"
         id="glyph0-2"
         style="overflow:visible">
        <path
           style="stroke:none"
           d="m 2.578125,-3.703125 c 0,1.710937 0.273438,3.117187 0.828125,4.21875 C 3.957031,1.628906 4.796875,2.375 5.921875,2.75 L 5.75,3.3125 C 4.320313,2.9375 3.222656,2.121094 2.453125,0.875 1.691406,-0.363281 1.3125,-1.867188 1.3125,-3.640625 c 0,-1.757813 0.378906,-3.257813 1.140625,-4.5 0.769531,-1.246094 1.867188,-2.0625 3.296875,-2.4375 l 0.203125,0.5625 c -1.148437,0.375 -1.996094,1.113281 -2.546875,2.203125 -0.554687,1.085937 -0.828125,2.457031 -0.828125,4.109375 z"
           id="path15"
           inkscape:connector-curvature="0" />
      </symbol>
      <symbol
         overflow="visible"
         id="glyph0-3"
         style="overflow:visible">
        <path
           style="stroke:none"
           d="M 3.328125,-0.984375 C 3.835938,-1.542969 4.273438,-2.082031 4.640625,-2.59375 5.003906,-3.113281 5.300781,-3.664063 5.53125,-4.25 5.757813,-4.832031 5.875,-5.414063 5.875,-6 5.875,-6.214844 5.855469,-6.429688 5.828125,-6.640625 L 5.90625,-7 7.375,-7 c -0.117187,1.085937 -0.445312,2.105469 -0.984375,3.0625 -0.53125,0.960937 -1.550781,2.292969 -3.046875,4 l -1.0625,0 C 2.25,-1.195313 2.195313,-2.394531 2.125,-3.53125 2.070313,-4.457031 2.023438,-5.085938 1.984375,-5.421875 1.921875,-5.785156 1.835938,-6.03125 1.734375,-6.15625 1.648438,-6.238281 1.535156,-6.28125 1.390625,-6.28125 1.273438,-6.28125 1.144531,-6.226563 1,-6.125 0.863281,-6.03125 0.699219,-5.886719 0.515625,-5.703125 l -0.40625,-0.40625 c 0.332031,-0.300781 0.582031,-0.507813 0.75,-0.625 C 1.035156,-6.855469 1.207031,-6.953125 1.375,-7.015625 1.550781,-7.085938 1.738281,-7.125 1.9375,-7.125 c 0.277344,0 0.5,0.054687 0.65625,0.15625 0.164063,0.09375 0.296875,0.246094 0.390625,0.453125 0.089844,0.199219 0.160156,0.480469 0.203125,0.84375 0.039063,0.355469 0.070313,0.933594 0.09375,1.734375 0.027344,0.804687 0.046875,1.789062 0.046875,2.953125 z"
           id="path18"
           inkscape:connector-curvature="0" />
      </symbol>
      <symbol
         overflow="visible"
         id="glyph0-4"
         style="overflow:visible">
        <path
           style="stroke:none"
           d="M 3.640625,-3.703125 C 3.640625,-5.355469 3.363281,-6.726563 2.8125,-7.8125 2.269531,-8.902344 1.425781,-9.640625 0.28125,-10.015625 l 0.1875,-0.5625 c 1.425781,0.375 2.519531,1.191406 3.28125,2.4375 0.769531,1.242187 1.15625,2.742187 1.15625,4.5 0,1.773437 -0.382812,3.277344 -1.140625,4.515625 C 3.003906,2.121094 1.902344,2.9375 0.46875,3.3125 L 0.296875,2.75 C 1.429688,2.375 2.269531,1.628906 2.8125,0.515625 3.363281,-0.585938 3.640625,-1.992188 3.640625,-3.703125 Z"
           id="path21"
           inkscape:connector-curvature="0" />
      </symbol>
      <symbol
         overflow="visible"
         id="glyph0-5"
         style="overflow:visible">
        <path
           style="stroke:none"
           d="M 6.25,-3.3125 5.78125,-2.5 3.890625,-3.828125 l 0.21875,2.296875 -0.96875,0 0.21875,-2.296875 L 1.46875,-2.5 0.984375,-3.3125 l 2.09375,-0.984375 -2.09375,-0.96875 0.484375,-0.828125 1.890625,1.328125 -0.21875,-2.28125 0.96875,0 -0.21875,2.28125 L 5.78125,-6.09375 6.25,-5.265625 4.171875,-4.296875 Z"
           id="path24"
           inkscape:connector-curvature="0" />
      </symbol>
      <symbol
         overflow="visible"
         id="glyph0-6"
         style="overflow:visible">
        <path
           style="stroke:none"
           d="m 7.78125,-23.421875 0.34375,0.5625 c -1.730469,1.761719 -3.070312,4.285156 -4.015625,7.5625 -0.9375,3.28125 -1.40625,6.945312 -1.40625,10.984375 0,3.960937 0.46875,7.601563 1.40625,10.9375 0.933594,3.339844 2.273438,5.898438 4.015625,7.671875 l -0.34375,0.53125 C 5.769531,13.117188 4.175781,10.535156 3,7.078125 1.820313,3.617188 1.234375,-0.175781 1.234375,-4.3125 c 0,-4.195313 0.585938,-8 1.765625,-11.40625 1.175781,-3.414063 2.769531,-5.984375 4.78125,-7.703125 z"
           id="path27"
           inkscape:connector-curvature="0" />
      </symbol>
      <symbol
         overflow="visible"
         id="glyph0-7"
         style="overflow:visible">
        <path
           style="stroke:none"
           d="m 2,-4.640625 c 0.101563,-0.464844 0.15625,-0.832031 0.15625,-1.09375 0,-0.183594 -0.035156,-0.320313 -0.09375,-0.40625 C 2,-6.230469 1.898438,-6.28125 1.765625,-6.28125 c -0.15625,0 -0.320312,0.066406 -0.484375,0.1875 -0.167969,0.125 -0.398437,0.351562 -0.6875,0.671875 l -0.421875,-0.40625 c 0.445313,-0.464844 0.820313,-0.800781 1.125,-1 C 1.597656,-7.023438 1.9375,-7.125 2.3125,-7.125 c 0.300781,0 0.539063,0.105469 0.71875,0.3125 0.175781,0.199219 0.265625,0.460937 0.265625,0.78125 0,0.261719 -0.058594,0.554687 -0.171875,0.875 l 0.09375,0.015625 C 3.695313,-5.804688 4.148438,-6.300781 4.578125,-6.625 c 0.433594,-0.332031 0.882813,-0.5 1.34375,-0.5 0.445313,0 0.789063,0.136719 1.03125,0.40625 0.246094,0.261719 0.375,0.621094 0.375,1.078125 0,0.3125 -0.070312,0.753906 -0.203125,1.3125 L 6.640625,-2.40625 c -0.125,0.53125 -0.1875,0.910156 -0.1875,1.125 0,0.199219 0.03125,0.347656 0.09375,0.4375 0.058594,0.085937 0.160156,0.125 0.296875,0.125 0.144531,0 0.300781,-0.054688 0.46875,-0.171875 C 7.476563,-1.011719 7.710938,-1.25 8.015625,-1.59375 L 8.4375,-1.171875 C 8.007813,-0.722656 7.636719,-0.394531 7.328125,-0.1875 7.015625,0.0195313 6.660156,0.125 6.265625,0.125 5.941406,0.125 5.683594,0.0078125 5.5,-0.21875 5.3125,-0.445313 5.21875,-0.738281 5.21875,-1.09375 c 0,-0.308594 0.078125,-0.773438 0.234375,-1.390625 L 5.78125,-3.75 C 5.894531,-4.214844 5.96875,-4.5625 6,-4.78125 6.039063,-4.996094 6.0625,-5.175781 6.0625,-5.3125 6.0625,-5.644531 6.003906,-5.882813 5.890625,-6.03125 5.785156,-6.183594 5.601563,-6.265625 5.34375,-6.265625 c -0.199219,0 -0.417969,0.085937 -0.65625,0.25 -0.242187,0.167969 -0.496094,0.417969 -0.765625,0.75 C 3.660156,-4.941406 3.445313,-4.621094 3.28125,-4.3125 3.125,-4.007813 2.992188,-3.628906 2.890625,-3.171875 L 2.203125,0 0.9375,0 Z"
           id="path30"
           inkscape:connector-curvature="0" />
      </symbol>
      <symbol
         overflow="visible"
         id="glyph0-8"
         style="overflow:visible">
        <path
           style="stroke:none"
           d="m 0.828125,-23.421875 c 2.007813,1.71875 3.601563,4.289062 4.78125,7.703125 C 6.785156,-12.3125 7.375,-8.507813 7.375,-4.3125 c 0,4.136719 -0.589844,7.929688 -1.765625,11.390625 -1.179687,3.457031 -2.773437,6.039063 -4.78125,7.75 l -0.34375,-0.53125 c 1.726563,-1.773437 3.0625,-4.332031 4,-7.671875 0.933594,-3.335937 1.40625,-6.976563 1.40625,-10.9375 0,-4.039063 -0.476562,-7.703125 -1.421875,-10.984375 -0.9375,-3.277344 -2.269531,-5.800781 -3.984375,-7.5625 z"
           id="path33"
           inkscape:connector-curvature="0" />
      </symbol>
      <symbol
         overflow="visible"
         id="glyph1-0"
         style="overflow:visible">
        <path
           style="stroke:none"
           d="m 3.046875,-2.609375 0,-0.125 c 0,-0.082031 0.00391,-0.15625 0.015625,-0.21875 0.00781,-0.058594 0.035156,-0.128906 0.078125,-0.203125 0.039063,-0.082031 0.097656,-0.171875 0.171875,-0.265625 0.070313,-0.089844 0.171875,-0.207031 0.296875,-0.34375 0.082031,-0.089844 0.15625,-0.179688 0.21875,-0.265625 0.070313,-0.082031 0.132813,-0.171875 0.1875,-0.265625 0.050781,-0.089844 0.085938,-0.1875 0.109375,-0.28125 0.027344,-0.101563 0.046875,-0.21875 0.046875,-0.34375 0,-0.269531 -0.066406,-0.476563 -0.1875,-0.625 -0.117187,-0.144531 -0.285156,-0.21875 -0.5,-0.21875 -0.117187,0 -0.214844,0.023437 -0.296875,0.0625 C 3.101563,-5.671875 3.023438,-5.621094 2.953125,-5.5625 2.890625,-5.5 2.835938,-5.417969 2.796875,-5.328125 2.753906,-5.242188 2.714844,-5.144531 2.6875,-5.03125 l -0.515625,0 0,-0.703125 c 0.207031,-0.101563 0.429688,-0.195313 0.671875,-0.28125 0.246094,-0.082031 0.492188,-0.125 0.734375,-0.125 0.246094,0 0.460938,0.027344 0.640625,0.078125 0.175781,0.054687 0.320313,0.128906 0.4375,0.21875 0.113281,0.085937 0.191406,0.191406 0.234375,0.3125 0.050781,0.125 0.078125,0.261719 0.078125,0.40625 0,0.136719 -0.019531,0.261719 -0.046875,0.375 -0.023437,0.117187 -0.066406,0.230469 -0.125,0.34375 -0.0625,0.105469 -0.152344,0.222656 -0.265625,0.34375 -0.105469,0.125 -0.238281,0.269531 -0.390625,0.421875 -0.117187,0.125 -0.210937,0.230469 -0.28125,0.3125 -0.0625,0.074219 -0.117187,0.148437 -0.15625,0.21875 -0.03125,0.0625 -0.058594,0.132812 -0.078125,0.203125 -0.011719,0.074219 -0.015625,0.164062 -0.015625,0.265625 l 0,0.03125 z m 0.671875,0.578125 0,0.875 -0.78125,0 0,-0.875 z M 5.671875,-0.5 l 0,-6.328125 -4.09375,0 0,6.328125 z M 6.21875,-7.328125 6.21875,0 1.015625,0 l 0,-7.328125 z"
           id="path36"
           inkscape:connector-curvature="0" />
      </symbol>
      <symbol
         overflow="visible"
         id="glyph1-1"
         style="overflow:visible">
        <path
           style="stroke:none"
           d="m 3.03125,-7.234375 -0.25,1.03125 -0.9375,0 0.234375,-1.03125 z M 1.3125,-3.625 C 1.382813,-3.976563 1.421875,-4.242188 1.421875,-4.421875 1.421875,-4.585938 1.382813,-4.695313 1.3125,-4.75 1.238281,-4.808594 1.085938,-4.84375 0.859375,-4.84375 l 0.0625,-0.296875 1.3125,-0.046875 0.3125,0 -0.78125,3.453125 C 1.691406,-1.378906 1.65625,-1.113281 1.65625,-0.9375 c 0,0.148437 0.019531,0.253906 0.0625,0.3125 0.050781,0.0625 0.125,0.09375 0.21875,0.09375 0.113281,0 0.226563,-0.039063 0.34375,-0.125 0.121094,-0.089844 0.296875,-0.265625 0.515625,-0.515625 l 0.3125,0.3125 C 2.753906,-0.492188 2.464844,-0.242188 2.25,-0.109375 2.03125,0.0234375 1.785156,0.09375 1.515625,0.09375 c -0.230469,0 -0.417969,-0.0859375 -0.5625,-0.25 C 0.816406,-0.332031 0.75,-0.554688 0.75,-0.828125 c 0,-0.269531 0.050781,-0.613281 0.15625,-1.03125 z"
           id="path39"
           inkscape:connector-curvature="0" />
      </symbol>
      <symbol
         overflow="visible"
         id="glyph1-2"
         style="overflow:visible">
        <path
           style="stroke:none"
           d="m 1.46875,-3.40625 c 0.070313,-0.339844 0.109375,-0.609375 0.109375,-0.796875 0,-0.144531 -0.027344,-0.25 -0.078125,-0.3125 -0.042969,-0.058594 -0.113281,-0.09375 -0.203125,-0.09375 -0.117187,0 -0.238281,0.050781 -0.359375,0.140625 -0.125,0.09375 -0.292969,0.261719 -0.5,0.5 L 0.125,-4.28125 C 0.457031,-4.621094 0.734375,-4.863281 0.953125,-5 1.167969,-5.144531 1.414063,-5.21875 1.6875,-5.21875 c 0.226563,0 0.40625,0.074219 0.53125,0.21875 0.132813,0.148437 0.203125,0.339844 0.203125,0.578125 0,0.1875 -0.042969,0.402344 -0.125,0.640625 l 0.0625,0.015625 c 0.351563,-0.488281 0.6875,-0.851563 1,-1.09375 C 3.667969,-5.097656 4,-5.21875 4.34375,-5.21875 c 0.332031,0 0.585938,0.101562 0.765625,0.296875 0.175781,0.1875 0.265625,0.449219 0.265625,0.78125 0,0.230469 -0.054687,0.554687 -0.15625,0.96875 L 4.875,-1.765625 c -0.09375,0.386719 -0.140625,0.664062 -0.140625,0.828125 0,0.148437 0.019531,0.253906 0.0625,0.3125 0.039063,0.0625 0.113281,0.09375 0.21875,0.09375 0.101563,0 0.21875,-0.039063 0.34375,-0.125 C 5.480469,-0.746094 5.65625,-0.921875 5.875,-1.171875 l 0.3125,0.3125 C 5.875,-0.535156 5.601563,-0.292969 5.375,-0.140625 5.144531,0.0117188 4.882813,0.09375 4.59375,0.09375 c -0.230469,0 -0.417969,-0.0859375 -0.5625,-0.25 C 3.894531,-0.320313 3.828125,-0.535156 3.828125,-0.796875 3.828125,-1.035156 3.882813,-1.378906 4,-1.828125 L 4.234375,-2.75 C 4.316406,-3.089844 4.375,-3.34375 4.40625,-3.5 c 0.027344,-0.164063 0.046875,-0.296875 0.046875,-0.390625 0,-0.246094 -0.042969,-0.425781 -0.125,-0.53125 -0.085937,-0.113281 -0.222656,-0.171875 -0.40625,-0.171875 -0.148437,0 -0.308594,0.066406 -0.484375,0.1875 C 3.257813,-4.289063 3.070313,-4.105469 2.875,-3.859375 2.6875,-3.617188 2.527344,-3.382813 2.40625,-3.15625 2.289063,-2.9375 2.195313,-2.660156 2.125,-2.328125 L 1.609375,0 0.6875,0 Z"
           id="path42"
           inkscape:connector-curvature="0" />
      </symbol>
      <symbol
         overflow="visible"
         id="glyph1-3"
         style="overflow:visible">
        <path
           style="stroke:none"
           d="m 2.390625,-3.84375 c 0.339844,-0.476563 0.675781,-0.828125 1,-1.046875 0.332031,-0.214844 0.664063,-0.328125 1,-0.328125 0.257813,0 0.472656,0.023437 0.640625,0.0625 l -0.25,1.203125 -0.546875,0 C 4.203125,-4.105469 4.164063,-4.226563 4.125,-4.3125 4.09375,-4.394531 4.050781,-4.453125 4,-4.484375 3.945313,-4.511719 3.878906,-4.53125 3.796875,-4.53125 c -0.136719,0 -0.285156,0.058594 -0.4375,0.171875 -0.148437,0.117187 -0.316406,0.292969 -0.5,0.53125 C 2.671875,-3.597656 2.519531,-3.371094 2.40625,-3.15625 2.289063,-2.9375 2.195313,-2.660156 2.125,-2.328125 L 1.609375,0 0.6875,0 1.46875,-3.40625 c 0.039063,-0.214844 0.066406,-0.382813 0.078125,-0.5 0.019531,-0.113281 0.03125,-0.210938 0.03125,-0.296875 0,-0.144531 -0.027344,-0.25 -0.078125,-0.3125 -0.042969,-0.058594 -0.113281,-0.09375 -0.203125,-0.09375 -0.117187,0 -0.238281,0.050781 -0.359375,0.140625 -0.125,0.09375 -0.292969,0.261719 -0.5,0.5 L 0.125,-4.28125 C 0.457031,-4.621094 0.734375,-4.863281 0.953125,-5 1.167969,-5.144531 1.414063,-5.21875 1.6875,-5.21875 c 0.226563,0 0.40625,0.074219 0.53125,0.21875 0.132813,0.148437 0.203125,0.339844 0.203125,0.578125 0,0.179687 -0.039062,0.363281 -0.109375,0.546875 z"
           id="path45"
           inkscape:connector-curvature="0" />
      </symbol>
      <symbol
         overflow="visible"
         id="glyph1-4"
         style="overflow:visible">
        <path
           style="stroke:none"
           d="M 4.5,-1.0625 C 4.144531,-0.6875 3.789063,-0.398438 3.4375,-0.203125 3.082031,-0.00390625 2.667969,0.09375 2.203125,0.09375 1.679688,0.09375 1.273438,-0.0625 0.984375,-0.375 0.703125,-0.695313 0.5625,-1.144531 0.5625,-1.71875 c 0,-0.371094 0.066406,-0.78125 0.203125,-1.21875 0.144531,-0.445313 0.351563,-0.84375 0.625,-1.1875 0.277344,-0.351563 0.613281,-0.625 1,-0.8125 0.394531,-0.183594 0.8125,-0.28125 1.25,-0.28125 0.433594,0 0.765625,0.089844 0.984375,0.265625 0.214844,0.167969 0.328125,0.441406 0.328125,0.8125 0,0.605469 -0.289062,1.066406 -0.859375,1.375 -0.574219,0.304687 -1.425781,0.453125 -2.546875,0.453125 -0.042969,0.210937 -0.0625,0.445312 -0.0625,0.703125 0,0.375 0.070313,0.648437 0.21875,0.8125 0.144531,0.167969 0.382813,0.25 0.71875,0.25 0.332031,0 0.628906,-0.066406 0.890625,-0.203125 0.269531,-0.144531 0.550781,-0.367188 0.84375,-0.671875 z M 1.640625,-2.765625 C 2.136719,-2.773438 2.570313,-2.820313 2.9375,-2.90625 3.300781,-2.996094 3.578125,-3.140625 3.765625,-3.328125 3.960938,-3.511719 4.0625,-3.773438 4.0625,-4.109375 c 0,-0.214844 -0.054687,-0.382813 -0.15625,-0.5 -0.105469,-0.121094 -0.257812,-0.1875 -0.453125,-0.1875 -0.367187,0 -0.714844,0.183594 -1.046875,0.546875 -0.335937,0.367187 -0.589844,0.863281 -0.765625,1.484375 z"
           id="path48"
           inkscape:connector-curvature="0" />
      </symbol>
      <symbol
         overflow="visible"
         id="glyph1-5"
         style="overflow:visible">
        <path
           style="stroke:none"
           d="M 2.3125,0.09375 C 2.144531,0.863281 1.886719,1.441406 1.546875,1.828125 1.210938,2.210938 0.789063,2.40625 0.28125,2.40625 0.125,2.40625 0.00390625,2.394531 -0.078125,2.375 l 0.09375,-0.46875 c 0.0273438,0.00781 0.113281,0.015625 0.25,0.015625 0.152344,0 0.289063,-0.042969 0.40625,-0.125 0.113281,-0.085937 0.21875,-0.230469 0.3125,-0.4375 0.101563,-0.199219 0.195313,-0.480469 0.28125,-0.84375 l 1.15625,-5.109375 -0.90625,0 0.078125,-0.375 c 0.238281,-0.00781 0.410156,-0.023438 0.515625,-0.046875 0.101563,-0.027344 0.1875,-0.066406 0.25,-0.109375 0.058594,-0.050781 0.113281,-0.117188 0.15625,-0.203125 0.039063,-0.082031 0.09375,-0.234375 0.15625,-0.453125 0.183594,-0.632813 0.476563,-1.113281 0.875,-1.4375 0.394531,-0.332031 0.898438,-0.5 1.515625,-0.5 0.351563,0 0.65625,0.035156 0.90625,0.09375 l -0.203125,0.90625 -0.484375,0 C 5.226563,-6.914063 5.160156,-7.054688 5.078125,-7.140625 5.003906,-7.230469 4.886719,-7.28125 4.734375,-7.28125 c -0.210937,0 -0.386719,0.058594 -0.53125,0.171875 -0.136719,0.105469 -0.257812,0.273437 -0.359375,0.5 C 3.75,-6.390625 3.660156,-6.089844 3.578125,-5.71875 l -0.140625,0.578125 1.375,0 -0.109375,0.546875 -1.390625,0 z"
           id="path51"
           inkscape:connector-curvature="0" />
      </symbol>
      <symbol
         overflow="visible"
         id="glyph2-0"
         style="overflow:visible">
        <path
           style="stroke:none"
           d="m 4.15625,-3.5625 0,-0.171875 c 0,-0.101563 0.00391,-0.195313 0.015625,-0.28125 C 4.191406,-4.105469 4.226563,-4.207031 4.28125,-4.3125 4.332031,-4.414063 4.410156,-4.53125 4.515625,-4.65625 4.617188,-4.789063 4.753906,-4.953125 4.921875,-5.140625 5.035156,-5.261719 5.140625,-5.382813 5.234375,-5.5 5.324219,-5.613281 5.40625,-5.734375 5.46875,-5.859375 5.539063,-5.980469 5.59375,-6.113281 5.625,-6.25 5.664063,-6.382813 5.6875,-6.539063 5.6875,-6.71875 5.6875,-7.082031 5.601563,-7.363281 5.4375,-7.5625 5.28125,-7.757813 5.050781,-7.859375 4.75,-7.859375 c -0.15625,0 -0.292969,0.027344 -0.40625,0.078125 -0.117187,0.042969 -0.222656,0.113281 -0.3125,0.203125 -0.085937,0.085937 -0.160156,0.191406 -0.21875,0.3125 C 3.75,-7.148438 3.695313,-7.019531 3.65625,-6.875 l -0.703125,0 0,-0.953125 c 0.289063,-0.144531 0.601563,-0.269531 0.9375,-0.375 0.332031,-0.113281 0.664063,-0.171875 1,-0.171875 0.332031,0 0.617188,0.039062 0.859375,0.109375 0.246094,0.0625 0.445313,0.160156 0.59375,0.28125 0.152344,0.125 0.265625,0.277344 0.328125,0.453125 0.070313,0.167969 0.109375,0.351562 0.109375,0.546875 0,0.1875 -0.023437,0.363281 -0.0625,0.515625 -0.03125,0.148437 -0.097656,0.300781 -0.1875,0.453125 -0.085937,0.148437 -0.199219,0.308594 -0.34375,0.484375 -0.148437,0.167969 -0.332031,0.363281 -0.546875,0.578125 -0.15625,0.15625 -0.285156,0.292969 -0.375,0.40625 C 5.179688,-4.441406 5.113281,-4.339844 5.0625,-4.25 c -0.054687,0.09375 -0.089844,0.195312 -0.109375,0.296875 -0.023437,0.09375 -0.03125,0.210937 -0.03125,0.34375 l 0,0.046875 z m 0.90625,0.796875 0,1.1875 -1.0625,0 0,-1.1875 z m 2.671875,2.078125 0,-8.625 -5.59375,0 0,8.625 z m 0.75,-9.296875 0,9.984375 -7.09375,0 0,-9.984375 z"
           id="path54"
           inkscape:connector-curvature="0" />
      </symbol>
      <symbol
         overflow="visible"
         id="glyph2-1"
         style="overflow:visible">
        <path
           style="stroke:none"
           d="m 1.09375,-5.3125 0,-0.984375 9.015625,0 0,0.984375 z m 0,3.03125 0,-0.96875 9.015625,0 0,0.96875 z m 9.328125,-2 z"
           id="path57"
           inkscape:connector-curvature="0" />
      </symbol>
      <symbol
         overflow="visible"
         id="glyph3-0"
         style="overflow:visible">
        <path
           style="stroke:none"
           d="m 3.046875,-2.609375 0,-0.125 c 0,-0.082031 0.00391,-0.15625 0.015625,-0.21875 0.00781,-0.058594 0.035156,-0.128906 0.078125,-0.203125 0.039063,-0.082031 0.097656,-0.171875 0.171875,-0.265625 0.070313,-0.089844 0.171875,-0.207031 0.296875,-0.34375 0.082031,-0.089844 0.15625,-0.179688 0.21875,-0.265625 0.070313,-0.082031 0.132813,-0.171875 0.1875,-0.265625 0.050781,-0.089844 0.085938,-0.1875 0.109375,-0.28125 0.027344,-0.101563 0.046875,-0.21875 0.046875,-0.34375 0,-0.269531 -0.066406,-0.476563 -0.1875,-0.625 -0.117187,-0.144531 -0.285156,-0.21875 -0.5,-0.21875 -0.117187,0 -0.214844,0.023437 -0.296875,0.0625 C 3.101563,-5.671875 3.023438,-5.621094 2.953125,-5.5625 2.890625,-5.5 2.835938,-5.417969 2.796875,-5.328125 2.753906,-5.242188 2.714844,-5.144531 2.6875,-5.03125 l -0.515625,0 0,-0.703125 c 0.207031,-0.101563 0.429688,-0.195313 0.671875,-0.28125 0.246094,-0.082031 0.492188,-0.125 0.734375,-0.125 0.246094,0 0.460938,0.027344 0.640625,0.078125 0.175781,0.054687 0.320313,0.128906 0.4375,0.21875 0.113281,0.085937 0.191406,0.191406 0.234375,0.3125 0.050781,0.125 0.078125,0.261719 0.078125,0.40625 0,0.136719 -0.019531,0.261719 -0.046875,0.375 -0.023437,0.117187 -0.066406,0.230469 -0.125,0.34375 -0.0625,0.105469 -0.152344,0.222656 -0.265625,0.34375 -0.105469,0.125 -0.238281,0.269531 -0.390625,0.421875 -0.117187,0.125 -0.210937,0.230469 -0.28125,0.3125 -0.0625,0.074219 -0.117187,0.148437 -0.15625,0.21875 -0.03125,0.0625 -0.058594,0.132812 -0.078125,0.203125 -0.011719,0.074219 -0.015625,0.164062 -0.015625,0.265625 l 0,0.03125 z m 0.671875,0.578125 0,0.875 -0.78125,0 0,-0.875 z M 5.671875,-0.5 l 0,-6.328125 -4.09375,0 0,6.328125 z M 6.21875,-7.328125 6.21875,0 1.015625,0 l 0,-7.328125 z"
           id="path60"
           inkscape:connector-curvature="0" />
      </symbol>
      <symbol
         overflow="visible"
         id="glyph3-1"
         style="overflow:visible">
        <path
           style="stroke:none"
           d="m 3.765625,-0.859375 c 0.175781,0 0.316406,-0.007813 0.421875,-0.03125 C 4.300781,-0.910156 4.390625,-0.945313 4.453125,-1 4.511719,-1.050781 4.5625,-1.113281 4.59375,-1.1875 4.632813,-1.269531 4.6875,-1.394531 4.75,-1.5625 l 0.453125,0 L 5.109375,0 0.6875,0 l 0,-0.265625 c 0.152344,-0.371094 0.363281,-0.753906 0.625,-1.140625 0.257813,-0.394531 0.628906,-0.859375 1.109375,-1.390625 0.414063,-0.457031 0.71875,-0.804688 0.90625,-1.046875 0.195313,-0.257813 0.34375,-0.484375 0.4375,-0.671875 0.101563,-0.183594 0.175781,-0.363281 0.21875,-0.53125 0.039063,-0.164063 0.0625,-0.332031 0.0625,-0.5 0,-0.269531 -0.042969,-0.503906 -0.125,-0.703125 C 3.835938,-6.457031 3.707031,-6.617188 3.53125,-6.734375 3.351563,-6.855469 3.128906,-6.921875 2.859375,-6.921875 2.191406,-6.921875 1.738281,-6.550781 1.5,-5.8125 l -0.640625,0 0,-1.03125 C 1.285156,-7.039063 1.6875,-7.1875 2.0625,-7.28125 c 0.382813,-0.089844 0.726563,-0.140625 1.03125,-0.140625 0.664063,0 1.164063,0.148437 1.5,0.4375 0.339844,0.292969 0.515625,0.722656 0.515625,1.28125 0,0.1875 -0.023437,0.363281 -0.0625,0.515625 C 5.015625,-5.03125 4.957031,-4.871094 4.875,-4.71875 4.789063,-4.5625 4.679688,-4.386719 4.546875,-4.203125 4.410156,-4.023438 4.257813,-3.839844 4.09375,-3.65625 3.925781,-3.476563 3.644531,-3.175781 3.25,-2.75 2.5625,-2.03125 2.058594,-1.398438 1.75,-0.859375 Z"
           id="path63"
           inkscape:connector-curvature="0" />
      </symbol>
      <symbol
         overflow="visible"
         id="glyph4-0"
         style="overflow:visible">
        <path
           style="stroke:none"
           d="m 7.15625,-9.484375 0,9.484375 -6.828125,0 0,-9.484375 z m -0.625,8.890625 0,-8.296875 -5.59375,0 0,8.296875 z M 5.625,-6.265625 c 0,0.292969 -0.050781,0.554687 -0.140625,0.78125 -0.085937,0.21875 -0.207031,0.410156 -0.359375,0.5625 -0.148437,0.15625 -0.332031,0.277344 -0.546875,0.359375 -0.210937,0.085937 -0.441406,0.136719 -0.6875,0.15625 l -0.03125,1.109375 c 0,0.054687 -0.039062,0.089844 -0.109375,0.109375 -0.074219,0.011719 -0.175781,0.015625 -0.296875,0.015625 -0.074219,0 -0.136719,0 -0.1875,0 -0.054687,0 -0.097656,-0.00391 -0.125,-0.015625 C 3.109375,-3.195313 3.082031,-3.207031 3.0625,-3.21875 3.050781,-3.238281 3.046875,-3.265625 3.046875,-3.296875 l -0.03125,-1.34375 c -0.011719,-0.144531 0.015625,-0.25 0.078125,-0.3125 0.070313,-0.058594 0.171875,-0.09375 0.296875,-0.09375 l 0.125,0 c 0.214844,0 0.398438,-0.023438 0.546875,-0.078125 0.144531,-0.058594 0.265625,-0.144531 0.359375,-0.25 0.089844,-0.101563 0.15625,-0.226563 0.1875,-0.375 0.039063,-0.144531 0.0625,-0.296875 0.0625,-0.453125 0,-0.351563 -0.105469,-0.632813 -0.3125,-0.84375 C 4.160156,-7.261719 3.839844,-7.375 3.40625,-7.375 c -0.1875,0 -0.355469,0.023437 -0.5,0.0625 -0.148437,0.03125 -0.277344,0.074219 -0.390625,0.125 -0.117187,0.042969 -0.210937,0.085937 -0.28125,0.125 C 2.171875,-7.019531 2.121094,-7 2.09375,-7 2.070313,-7 2.050781,-7.003906 2.03125,-7.015625 2.019531,-7.023438 2.003906,-7.039063 1.984375,-7.0625 1.972656,-7.089844 1.960938,-7.128906 1.953125,-7.171875 c 0,-0.050781 0,-0.117188 0,-0.203125 0,-0.082031 0.00391,-0.148438 0.015625,-0.203125 0.00781,-0.050781 0.035156,-0.097656 0.078125,-0.140625 0.027344,-0.027344 0.09375,-0.066406 0.1875,-0.109375 0.101563,-0.039063 0.222656,-0.082031 0.359375,-0.125 0.132813,-0.039063 0.28125,-0.078125 0.4375,-0.109375 0.164063,-0.027344 0.328125,-0.046875 0.484375,-0.046875 0.371094,0 0.691406,0.054687 0.953125,0.15625 0.257813,0.09375 0.472656,0.226562 0.640625,0.390625 C 5.285156,-7.394531 5.414063,-7.195313 5.5,-6.96875 5.582031,-6.75 5.625,-6.511719 5.625,-6.265625 Z M 4.015625,-2 c 0,0.105469 -0.011719,0.195312 -0.03125,0.265625 -0.011719,0.0625 -0.039062,0.117187 -0.078125,0.15625 -0.042969,0.042969 -0.101562,0.074219 -0.171875,0.09375 -0.0625,0.023437 -0.148437,0.03125 -0.25,0.03125 -0.117187,0 -0.210937,-0.00781 -0.28125,-0.03125 C 3.140625,-1.503906 3.082031,-1.535156 3.03125,-1.578125 2.988281,-1.617188 2.957031,-1.671875 2.9375,-1.734375 2.925781,-1.804688 2.921875,-1.894531 2.921875,-2 c 0,-0.101563 0.00391,-0.1875 0.015625,-0.25 0.019531,-0.070313 0.050781,-0.128906 0.09375,-0.171875 0.050781,-0.050781 0.109375,-0.085938 0.171875,-0.109375 0.070313,-0.019531 0.164063,-0.03125 0.28125,-0.03125 0.101563,0 0.1875,0.011719 0.25,0.03125 0.070313,0.023437 0.128906,0.058594 0.171875,0.109375 0.039063,0.042969 0.066406,0.101562 0.078125,0.171875 0.019531,0.0625 0.03125,0.148437 0.03125,0.25 z M 0,2.90625 Z"
           id="path66"
           inkscape:connector-curvature="0" />
      </symbol>
      <symbol
         overflow="visible"
         id="glyph4-1"
         style="overflow:visible">
        <path
           style="stroke:none"
           d=""
           id="path69"
           inkscape:connector-curvature="0" />
      </symbol>
    </g>
    <clipPath
       id="clip1">
      <path
         d="m 316,201 7,0 0,38.51953 -7,0 z"
         id="path72"
         inkscape:connector-curvature="0" />
    </clipPath>
    <clipPath
       id="clip2">
      <path
         d="m 342,229 7,0 0,10.51953 -7,0 z"
         id="path75"
         inkscape:connector-curvature="0" />
    </clipPath>
    <clipPath
       id="clip3">
      <path
         d="m 350,201 8,0 0,38.51953 -8,0 z"
         id="path78"
         inkscape:connector-curvature="0" />
    </clipPath>
  </defs>
  <g
     id="g83"
     style="fill:#000000;fill-opacity:1"
     transform="translate(-218.2616,-197.82806)">
    <use
       height="100%"
       width="100%"
       id="use85"
       y="224.73068"
       x="217.74597"
       xlink:href="#glyph0-1" />
  </g>
  <g
     id="g87"
     style="fill:#000000;fill-opacity:1"
     transform="translate(-218.2616,-197.82806)">
    <use
       height="100%"
       width="100%"
       id="use89"
       y="227.74985"
       x="224.92943"
       xlink:href="#glyph1-1" />
  </g>
  <g
     id="g91"
     style="fill:#000000;fill-opacity:1"
     transform="translate(-218.2616,-197.82806)">
    <use
       height="100%"
       width="100%"
       id="use93"
       y="227.74985"
       x="228.25484"
       xlink:href="#glyph1-2" />
  </g>
  <g
     id="g95"
     style="fill:#000000;fill-opacity:1"
     transform="translate(-218.2616,-197.82806)">
    <use
       height="100%"
       width="100%"
       id="use97"
       y="224.73068"
       x="240.41376"
       xlink:href="#glyph2-1" />
  </g>
  <g
     id="g99"
     style="fill:#000000;fill-opacity:1"
     transform="translate(-218.2616,-197.82806)">
    <use
       height="100%"
       width="100%"
       id="use101"
       y="224.73068"
       x="255.41919"
       xlink:href="#glyph0-1" />
  </g>
  <g
     id="g103"
     style="fill:#000000;fill-opacity:1"
     transform="translate(-218.2616,-197.82806)">
    <use
       height="100%"
       width="100%"
       id="use105"
       y="227.74985"
       x="262.60263"
       xlink:href="#glyph1-3" />
  </g>
  <g
     id="g107"
     style="fill:#000000;fill-opacity:1"
     transform="translate(-218.2616,-197.82806)">
    <use
       height="100%"
       width="100%"
       id="use109"
       y="227.74985"
       x="267.75171"
       xlink:href="#glyph1-4" />
  </g>
  <g
     id="g111"
     style="fill:#000000;fill-opacity:1"
     transform="translate(-218.2616,-197.82806)">
    <use
       height="100%"
       width="100%"
       id="use113"
       y="227.74985"
       x="273.00815"
       xlink:href="#glyph1-5" />
  </g>
  <g
     id="g115"
     style="fill:#000000;fill-opacity:1"
     transform="translate(-218.2616,-197.82806)">
    <use
       height="100%"
       width="100%"
       id="use117"
       y="224.25398"
       x="281.31155"
       xlink:href="#glyph0-2" />
  </g>
  <g
     id="g119"
     style="fill:#000000;fill-opacity:1"
     transform="translate(-218.2616,-197.82806)">
    <use
       height="100%"
       width="100%"
       id="use121"
       y="224.73068"
       x="287.37756"
       xlink:href="#glyph0-3" />
  </g>
  <g
     id="g123"
     style="fill:#000000;fill-opacity:1"
     transform="translate(-218.2616,-197.82806)">
    <use
       height="100%"
       width="100%"
       id="use125"
       y="224.25398"
       x="295.35919"
       xlink:href="#glyph0-4" />
  </g>
  <g
     id="g127"
     style="fill:#000000;fill-opacity:1"
     transform="translate(-218.2616,-197.82806)">
    <use
       height="100%"
       width="100%"
       id="use129"
       y="224.73068"
       x="304.61786"
       xlink:href="#glyph0-5" />
  </g>
  <g
     style="clip-rule:nonzero"
     id="g131"
     clip-path="url(#clip1)"
     transform="translate(-218.2616,-197.82806)">
    <g
       id="g133"
       style="fill:#000000;fill-opacity:1">
      <use
         height="100%"
         width="100%"
         id="use135"
         y="224.88957"
         x="314.83432"
         xlink:href="#glyph0-6" />
    </g>
  </g>
  <g
     id="g137"
     style="fill:#000000;fill-opacity:1"
     transform="translate(-218.2616,-197.82806)">
    <use
       height="100%"
       width="100%"
       id="use139"
       y="213.54434"
       x="326.96637"
       xlink:href="#glyph0-7" />
  </g>
  <g
     id="g141"
     style="fill:#000000;fill-opacity:1"
     transform="translate(-218.2616,-197.82806)">
    <use
       height="100%"
       width="100%"
       id="use143"
       y="216.59517"
       x="335.42422"
       xlink:href="#glyph1-1" />
  </g>
  <g
     id="g145"
     style="fill:#000000;fill-opacity:1"
     transform="translate(-218.2616,-197.82806)">
    <use
       height="100%"
       width="100%"
       id="use147"
       y="216.59517"
       x="338.74963"
       xlink:href="#glyph1-2" />
  </g>
  <g
     id="g149"
     style="fill:#000000;fill-opacity:1"
     transform="translate(-218.2616,-197.82806)">
    <use
       height="100%"
       width="100%"
       id="use151"
       y="234.6142"
       x="323.29483"
       xlink:href="#glyph0-7" />
  </g>
  <g
     id="g153"
     style="fill:#000000;fill-opacity:1"
     transform="translate(-218.2616,-197.82806)">
    <use
       height="100%"
       width="100%"
       id="use155"
       y="237.63324"
       x="331.75534"
       xlink:href="#glyph1-3" />
  </g>
  <g
     id="g157"
     style="fill:#000000;fill-opacity:1"
     transform="translate(-218.2616,-197.82806)">
    <use
       height="100%"
       width="100%"
       id="use159"
       y="237.63324"
       x="336.90442"
       xlink:href="#glyph1-4" />
  </g>
  <g
     style="clip-rule:nonzero"
     id="g161"
     clip-path="url(#clip2)"
     transform="translate(-218.2616,-197.82806)">
    <g
       id="g163"
       style="fill:#000000;fill-opacity:1">
      <use
         height="100%"
         width="100%"
         id="use165"
         y="237.63324"
         x="342.16083"
         xlink:href="#glyph1-5" />
    </g>
  </g>
  <path
     inkscape:connector-curvature="0"
     id="path167"
     d="m 105.03137,23.214906 27.14062,0 0,-0.95313 -27.14062,0 z"
     style="fill:#000000;fill-opacity:1;fill-rule:evenodd;stroke:none" />
  <g
     style="clip-rule:nonzero"
     id="g169"
     clip-path="url(#clip3)"
     transform="translate(-218.2616,-197.82806)">
    <g
       id="g171"
       style="fill:#000000;fill-opacity:1">
      <use
         height="100%"
         width="100%"
         id="use173"
         y="224.88957"
         x="350.42966"
         xlink:href="#glyph0-8" />
    </g>
  </g>
  <g
     id="g175"
     style="fill:#000000;fill-opacity:1"
     transform="translate(-218.2616,-197.82806)">
    <use
       height="100%"
       width="100%"
       id="use177"
       y="205.24994"
       x="358.93005"
       xlink:href="#glyph3-1" />
  </g>
  <g
     id="g179"
     style="fill:#000000;fill-opacity:1"
     transform="translate(-218.2616,-197.82806)">
    <use
       height="100%"
       width="100%"
       id="use181"
       y="224.73068"
       x="365.47498"
       xlink:href="#glyph4-1" />
  </g>
</svg>
