﻿# Resultfile Programm Air Drag - RC 1.2.0.0 Comp 5/31/2022
# Datafile: ,I:\martindippold\Git\VECTO-AirDrag\DemoData\DemoData_CAL.csdat
#
# Results
# fv_veh:,0.968523623448373
# fv_pe:,1.06989318855317
# beta_ame:,-0.0156820291773556
#
SecID [-],DirID [-],delta t [s],length [m],delta s [m],v (s) [km/h],v (GPS) [km/h],v_veh_CAN [km/h],v_veh [km/h],vair_ic [m/s],vair_uf [m/s],beta_ic [°],beta_uf [°],valid [-],used [-],val_User [-],val_vWind [-],val_vWind_1s [-],val_beta [-],val_vVeh_avg [-],val_vVeh_1s [-],vair [m/s],v_wind_avg [m/s],v_wind_1s [m/s],v_wind_1s_max [m/s],beta_avg [°],t_tire ,Satelites ,<n_card1> 
1,1,11.2999999999956,250.64,250.45382446212,79.8499115044556,79.980893015031,82.3803198054819,79.7872858388411,19.2047323410964,20.5470123197257,184.587338638373,184.603020667553,1,1,1,1,1,1,1,1,20.8449262865426,2.0866970767974,2.09619576155282,2.53092334630704,3.67277715388955,40,10,695.320601237843
2,1,11,250.64,250.75224200627,82.0276363636364,82.2655413260671,84.7335075658492,82.0664037751662,20.70066197396,22.1474972444814,184.247111716621,184.262793745801,1,1,1,1,1,1,1,1,22.2603078340773,1.78269912971261,1.77908992804873,2.54906668428361,3.42972899243816,40,10,712.554586739327
2,2,10.6399999999994,250.64,250.472193777193,84.8030075188016,84.9518938967139,87.500450713615,84.7462535785161,24.4830147104789,26.1942106739884,177.004713615023,177.020395644202,1,1,1,1,1,1,1,1,25.6752399054816,3.0124122145987,3.00710665910369,4.11513434342688,-2.45331841811061,40,10,743.914553990611
1,2,10.6500000000015,250.64,250.7523445353,84.7233802816786,84.9670816135084,87.5160940619137,84.7614045308932,24.3782373358349,26.0821100745423,176.063761726079,176.079443755257,1,1,1,1,1,1,1,1,25.5842033993016,2.7549982501573,2.77859459145704,3.16211176988224,-3.22396896353121,40,10,736.480112570356
1,1,10.6600000000035,250.64,250.696823703385,84.6439024389967,84.8684414245547,87.4144946672915,84.6630031170735,20.423548474433,21.8510153988813,183.103111527648,183.118793556826,1,1,1,1,1,1,1,1,22.1598442300631,2.19453875864304,2.19289063838544,3.06253301261684,2.4928803191671,40,11,735.378819119025
2,1,10.6499999999942,250.64,250.604957730902,84.7233802817365,84.9171106941837,87.4646240150094,84.7115545745665,20.8067989368386,22.261052458119,184.532448405253,184.548130434432,1,1,1,1,1,1,1,1,22.4920120481213,2.08322403854207,2.08518294471726,2.72488760029787,3.64259402940259,40,11,736.100375234522
2,2,10.6399999999994,250.64,250.55349095064,84.8030075188016,84.9794525821593,87.5288361596245,84.7737455535381,25.2851661971831,27.052427085801,176.351643192488,176.367325221667,1,1,1,1,1,1,1,1,26.3700368298922,3.45829671193864,3.4493733572984,4.81068321631995,-3.00578212092604,40,11,746.860845070422
1,2,10.6499999999942,250.64,250.746650019717,84.7233802817365,84.9650900562849,87.5140427579737,84.7594177945685,25.5039315196998,27.2864826142533,175.650984990619,175.666667019798,1,1,1,1,1,1,1,1,26.5576854535923,3.51988000080378,3.51465923184864,3.9431683247972,-3.5889555349191,40,11,736.683864915572
1,1,10.6699999999983,250.64,250.781108072626,84.564573570773,84.8172659176031,87.3617838951312,84.6119514890259,20.9580187265918,22.4228414811503,184.370018726592,184.38570075577,1,1,1,1,1,1,1,1,22.6179658723151,1.9485050706545,1.95238288952194,2.61582904581366,3.51997509987479,40,10.9578651685393,734.995692883895
2,1,10.6299999999974,250.64,250.387479894443,84.8827845719871,85.003032894737,87.5531238815792,84.7972687860111,20.1734087823872,21.5833926461747,182.068157894737,182.083839923916,1,1,1,1,1,1,1,1,21.950876078212,2.20087402385718,2.19927981438216,2.95511843235788,1.66393736590462,40,11,736.454511278195
2,2,10.6399999999994,250.64,250.679127754356,84.8030075188016,85.0221014084504,87.5727644507042,84.8162911411868,22.9512412102254,24.5553766396609,177.152657276995,177.168339306174,1,1,1,1,1,1,1,1,24.3537954207394,2.31599656919149,2.31770353494918,3.20387908569792,-2.30450362708794,40,11,737.155305164319
1,2,10.6399999999994,250.64,250.565467444674,84.8030075188016,84.9835286384976,87.5330344976527,84.7778117430978,22.0783101721503,23.6214336679477,177.022516431925,177.038198461104,1,1,1,1,1,1,1,1,23.5965584143012,2.57844992499934,2.57812357948132,4.85663968691699,-2.40540132556413,40,11,736.319624413145
1,1,10.6500000000015,250.64,250.638027485973,84.7233802816786,84.9282185741085,87.476065131332,84.7226355660033,21.0841275797373,22.557764484147,182.672964352721,182.688646381899,1,1,1,1,1,1,1,1,22.7347703901002,1.78628189723267,1.78091632070257,2.15315431832734,2.16129768582932,40,11,735.730393996248
2,1,10.6399999999994,250.64,250.60506857315,84.8030075188016,84.9970018779341,87.5469119342724,84.7912523682969,19.9308729785822,21.3239052417034,183.183389671361,183.19907170054,1,1,1,1,1,1,1,1,21.740926725603,2.32965697385166,2.33474802498079,2.74127568966885,2.54413011819714,40,11,736.543849765259
2,2,10.6400000000067,250.64,250.653362497167,84.8030075187436,85.0132826291077,87.5636811079812,84.8074937091799,23.8435797078967,25.5100835202033,176.397399061033,176.413081090211,1,1,1,1,1,1,1,1,25.1247136039031,2.96975625339722,2.96197083010338,3.96154281132417,-2.93782134248824,40,12,736.019342723003
1,2,10.6399999999994,250.64,250.636719548522,84.8030075188016,85.0077070422534,87.5579382535211,84.8019316189691,21.6582335941878,23.1719965985149,177.908497652582,177.924179681761,1,1,1,1,1,1,1,1,23.2354867609271,2.19756030162999,2.19243901056591,2.59949881410749,-1.67616839176951,40,11.9737089201878,736.0441314554
1,1,11.010000000002,250.64,250.814083611778,81.9531335149712,82.2046869328493,84.6708275408348,82.0056966902218,20.0300408348458,21.4300042556433,183.543021778584,183.558703807763,1,1,1,1,1,1,1,1,21.6782078728089,1.86763199502347,1.86599514955201,2.34388624943555,2.84813162589675,40,12,721.404537205082
2,1,10.6699999999983,250.64,250.645223912266,84.564573570773,84.7712743445691,87.3144125749063,84.5660712463146,19.6585698605618,21.0325699905117,180.191357677903,180.207039707081,1,1,1,1,1,1,1,1,21.4934339766047,2.53522972457828,2.5401713884829,3.26196740013925,0.174381214475198,40,12,734.464981273407
2,2,10.6499999999942,250.64,250.938079951415,84.7233802817365,85.0298949343339,87.5807917823639,84.8240658015325,23.1302271732176,24.746872502313,176.313977485929,176.329659515107,1,1,1,1,1,1,1,1,24.5087985465223,2.41273748693163,2.41705923849758,3.50436659678131,-2.98733328978342,40,9.98874296435272,736.455909943714
1,2,10.6299999999974,250.64,250.444123003137,84.8827845719871,85.022290413534,87.5729591259399,84.8164796887515,21.0942766813534,22.5686229388359,177.321287593985,177.336969623163,1,1,1,1,1,1,1,1,22.7479634916346,2.34368143920356,2.33575333081974,2.93120419287796,-2.13993025602327,40,10,736.415601503758
