<?xml version="1.0" encoding="UTF-8"?>
<!DOCTYPE svg PUBLIC '-//W3C//DTD SVG 1.0//EN'
          'http://www.w3.org/TR/2001/REC-SVG-20010904/DTD/svg10.dtd'>
<svg fill-opacity="0" xmlns:xlink="http://www.w3.org/1999/xlink" color-rendering="auto" color-interpolation="auto" text-rendering="auto" stroke="rgb(0,0,0)" stroke-linecap="square" width="683" stroke-miterlimit="10" shape-rendering="auto" stroke-opacity="0" fill="rgb(0,0,0)" stroke-dasharray="none" font-weight="normal" stroke-width="1" height="644" xmlns="http://www.w3.org/2000/svg" font-family="'Dialog'" font-style="normal" stroke-linejoin="miter" font-size="12px" stroke-dashoffset="0" image-rendering="auto"
><!--Generated by the Batik Graphics2D SVG Generator--><defs id="genericDefs"
  /><g
  ><defs id="defs1"
    ><clipPath clipPathUnits="userSpaceOnUse" id="clipPath1"
      ><path d="M-7 -7 L31 -7 L31 31 L-7 31 L-7 -7 Z"
      /></clipPath
      ><clipPath clipPathUnits="userSpaceOnUse" id="clipPath2"
      ><path d="M-7 -7 L316 -7 L316 87 L-7 87 L-7 -7 Z"
      /></clipPath
      ><clipPath clipPathUnits="userSpaceOnUse" id="clipPath3"
      ><path d="M0 0 L0 32 L305 32 L305 0 Z"
      /></clipPath
      ><clipPath clipPathUnits="userSpaceOnUse" id="clipPath4"
      ><path d="M-7 -7 L241 -7 L241 99 L-7 99 L-7 -7 Z"
      /></clipPath
      ><clipPath clipPathUnits="userSpaceOnUse" id="clipPath5"
      ><path d="M0 0 L0 32 L230 32 L230 0 Z"
      /></clipPath
      ><clipPath clipPathUnits="userSpaceOnUse" id="clipPath6"
      ><path d="M-7 -7 L316 -7 L316 113 L-7 113 L-7 -7 Z"
      /></clipPath
      ><clipPath clipPathUnits="userSpaceOnUse" id="clipPath7"
      ><path d="M0 0 L0 62 L305 62 L305 0 Z"
      /></clipPath
      ><clipPath clipPathUnits="userSpaceOnUse" id="clipPath8"
      ><path d="M-305 -15 L610 -15 L610 30 L-305 30 L-305 -15 Z"
      /></clipPath
      ><clipPath clipPathUnits="userSpaceOnUse" id="clipPath9"
      ><path d="M-230 -15 L460 -15 L460 30 L-230 30 L-230 -15 Z"
      /></clipPath
      ><clipPath clipPathUnits="userSpaceOnUse" id="clipPath10"
      ><path d="M0 0 L104 0 L104 242 L0 242 L0 0 Z"
      /></clipPath
      ><clipPath clipPathUnits="userSpaceOnUse" id="clipPath11"
      ><path d="M0 0 L0 63 L35 63 L35 168 L0 168 L0 242 L104 242 L104 180 L75 180 L75 60 L104 60 L104 0 Z"
      /></clipPath
      ><clipPath clipPathUnits="userSpaceOnUse" id="clipPath12"
      ><path d="M0 0 L0 242 L104 242 L104 175 L66 175 L66 55 L104 55 L104 0 Z"
      /></clipPath
      ><clipPath clipPathUnits="userSpaceOnUse" id="clipPath13"
      ><path d="M0 0 L0 242 L104 242 L104 168 L55 168 L55 63 L104 63 L104 0 Z"
      /></clipPath
      ><clipPath clipPathUnits="userSpaceOnUse" id="clipPath14"
      ><path d="M0 0 L104 0 L104 469 L0 469 L0 0 Z"
      /></clipPath
      ><clipPath clipPathUnits="userSpaceOnUse" id="clipPath15"
      ><path d="M0 0 L0 221 L40 221 L40 251 L0 251 L0 469 L104 469 L104 0 Z"
      /></clipPath
      ><clipPath clipPathUnits="userSpaceOnUse" id="clipPath16"
      ><path d="M0 0 L104 0 L104 137 L0 137 L0 0 Z"
      /></clipPath
      ><clipPath clipPathUnits="userSpaceOnUse" id="clipPath17"
      ><path d="M0 0 L0 137 L104 137 L104 0 Z"
      /></clipPath
      ><clipPath clipPathUnits="userSpaceOnUse" id="clipPath18"
      ><path d="M-157 -30 L314 -30 L314 60 L-157 60 L-157 -30 Z"
      /></clipPath
      ><clipPath clipPathUnits="userSpaceOnUse" id="clipPath19"
      ><path d="M-138 -105 L276 -105 L276 210 L-138 210 L-138 -105 Z"
      /></clipPath
      ><clipPath clipPathUnits="userSpaceOnUse" id="clipPath20"
      ><path d="M-227 -120 L454 -120 L454 240 L-227 240 L-227 -120 Z"
      /></clipPath
    ></defs
    ><g fill="white" text-rendering="geometricPrecision" fill-opacity="1" stroke-opacity="1" stroke="white"
    ><rect x="0" width="683" height="644" y="0" stroke="none"
      /><rect x="377" y="88" transform="translate(-377,-88)" fill="none" width="682" image-rendering="optimizeQuality" height="643" stroke="black"
      /><text x="384" y="105" transform="translate(-377,-88)" fill="black" image-rendering="optimizeQuality" stroke="none" xml:space="preserve"
      >Eco-Roll Activation</text
      ><line transform="translate(-377,-88)" fill="none" x1="377" x2="485" y1="112" image-rendering="optimizeQuality" y2="112" stroke="black"
      /><line transform="translate(-377,-88)" fill="none" x1="491" x2="491" y1="88" image-rendering="optimizeQuality" y2="102" stroke="black"
      /><line transform="translate(-377,-88)" fill="none" x1="491" x2="485" y1="102" image-rendering="optimizeQuality" y2="112" stroke="black"
    /></g
    ><g font-size="11px" transform="translate(302,34)" fill-opacity="1" fill="black" text-rendering="geometricPrecision" image-rendering="optimizeQuality" font-family="sans-serif" stroke="black" stroke-opacity="1"
    ><circle r="9.5" clip-path="url(#clipPath1)" cx="9.5" cy="9.5" stroke="none"
    /></g
    ><g font-size="11px" transform="translate(160,86)" fill-opacity="1" fill="rgb(122,207,245)" text-rendering="geometricPrecision" image-rendering="optimizeQuality" font-family="sans-serif" stroke="rgb(122,207,245)" stroke-opacity="1"
    ><rect x="0" y="0" clip-path="url(#clipPath2)" width="305" rx="10" ry="10" height="76" stroke="none"
    /></g
    ><g stroke-linecap="butt" font-size="11px" transform="translate(160,86)" fill-opacity="1" fill="black" text-rendering="geometricPrecision" image-rendering="optimizeQuality" font-family="sans-serif" stroke-linejoin="round" stroke="black" stroke-opacity="1" stroke-miterlimit="0"
    ><rect x="0" y="0" clip-path="url(#clipPath2)" fill="none" width="305" rx="10" ry="10" height="76"
    /></g
    ><g font-size="11px" transform="translate(160,101)" fill-opacity="1" fill="black" text-rendering="geometricPrecision" image-rendering="optimizeQuality" font-family="sans-serif" stroke="black" stroke-opacity="1"
    ><text x="6" xml:space="preserve" y="12" clip-path="url(#clipPath3)" stroke="none"
      >entry / </text
      ><text x="6" xml:space="preserve" y="27" clip-path="url(#clipPath3)" stroke="none"
      >    body = engine = on, clutch = closed</text
    ></g
    ><g font-size="11px" transform="translate(160,101)" fill-opacity="1" fill="black" text-rendering="geometricPrecision" image-rendering="optimizeQuality" font-family="sans-serif" stroke="black" stroke-opacity="1"
    ><line y2="0" fill="none" x1="0" clip-path="url(#clipPath3)" x2="304" y1="0"
    /></g
    ><g font-size="11px" transform="translate(235,301)" fill-opacity="1" fill="rgb(122,207,245)" text-rendering="geometricPrecision" image-rendering="optimizeQuality" font-family="sans-serif" stroke="rgb(122,207,245)" stroke-opacity="1"
    ><rect x="0" y="0" clip-path="url(#clipPath4)" width="230" rx="10" ry="10" height="88" stroke="none"
    /></g
    ><g stroke-linecap="butt" font-size="11px" transform="translate(235,301)" fill-opacity="1" fill="black" text-rendering="geometricPrecision" image-rendering="optimizeQuality" font-family="sans-serif" stroke-linejoin="round" stroke="black" stroke-opacity="1" stroke-miterlimit="0"
    ><rect x="0" y="0" clip-path="url(#clipPath4)" fill="none" width="230" rx="10" ry="10" height="88"
    /></g
    ><g font-size="11px" transform="translate(235,316)" fill-opacity="1" fill="black" text-rendering="geometricPrecision" image-rendering="optimizeQuality" font-family="sans-serif" stroke="black" stroke-opacity="1"
    ><text x="6" xml:space="preserve" y="12" clip-path="url(#clipPath5)" stroke="none"
      >do / </text
      ><text x="6" xml:space="preserve" y="27" clip-path="url(#clipPath5)" stroke="none"
      >    body = wait for "activation_delay" seconds</text
    ></g
    ><g font-size="11px" transform="translate(235,316)" fill-opacity="1" fill="black" text-rendering="geometricPrecision" image-rendering="optimizeQuality" font-family="sans-serif" stroke="black" stroke-opacity="1"
    ><line y2="0" fill="none" x1="0" clip-path="url(#clipPath5)" x2="229" y1="0"
    /></g
    ><g font-size="11px" transform="translate(160,528)" fill-opacity="1" fill="rgb(122,207,245)" text-rendering="geometricPrecision" image-rendering="optimizeQuality" font-family="sans-serif" stroke="rgb(122,207,245)" stroke-opacity="1"
    ><rect x="0" y="0" clip-path="url(#clipPath6)" width="305" rx="10" ry="10" height="102" stroke="none"
    /></g
    ><g stroke-linecap="butt" font-size="11px" transform="translate(160,528)" fill-opacity="1" fill="black" text-rendering="geometricPrecision" image-rendering="optimizeQuality" font-family="sans-serif" stroke-linejoin="round" stroke="black" stroke-opacity="1" stroke-miterlimit="0"
    ><rect x="0" y="0" clip-path="url(#clipPath6)" fill="none" width="305" rx="10" ry="10" height="102"
    /></g
    ><g font-size="11px" transform="translate(160,543)" fill-opacity="1" fill="black" text-rendering="geometricPrecision" image-rendering="optimizeQuality" font-family="sans-serif" stroke="black" stroke-opacity="1"
    ><text x="6" xml:space="preserve" y="12" clip-path="url(#clipPath7)" stroke="none"
      >entry / </text
      ><text x="6" xml:space="preserve" y="27" clip-path="url(#clipPath7)" stroke="none"
      >    body = </text
      ><text x="6" xml:space="preserve" y="42" clip-path="url(#clipPath7)" stroke="none"
      >        without engine stop: clutch = opened, engine = idling</text
      ><text x="6" xml:space="preserve" y="57" clip-path="url(#clipPath7)" stroke="none"
      >        with engine stop: clutch = opened, engine = off</text
    ></g
    ><g font-size="11px" transform="translate(160,543)" fill-opacity="1" fill="black" text-rendering="geometricPrecision" image-rendering="optimizeQuality" font-family="sans-serif" stroke="black" stroke-opacity="1"
    ><line y2="0" fill="none" x1="0" clip-path="url(#clipPath7)" x2="304" y1="0"
    /></g
    ><g font-size="11px" transform="translate(160,86)" fill-opacity="1" fill="black" text-rendering="geometricPrecision" image-rendering="optimizeQuality" font-family="sans-serif" stroke="black" stroke-opacity="1"
    ><text x="119" xml:space="preserve" y="12" clip-path="url(#clipPath8)" stroke="none"
      >Eco-Roll OFF</text
    ></g
    ><g font-size="11px" transform="translate(235,301)" fill-opacity="1" fill="black" text-rendering="geometricPrecision" image-rendering="optimizeQuality" font-family="sans-serif" stroke="black" stroke-opacity="1"
    ><text x="63" xml:space="preserve" y="12" clip-path="url(#clipPath9)" stroke="none"
      >Pre-Activation Phase</text
    ></g
    ><g font-size="11px" transform="translate(160,528)" fill-opacity="1" fill="black" text-rendering="geometricPrecision" image-rendering="optimizeQuality" font-family="sans-serif" stroke="black" stroke-opacity="1"
    ><text x="121" xml:space="preserve" y="12" clip-path="url(#clipPath8)" stroke="none"
      >Eco-Roll ON</text
    ></g
    ><g stroke-linecap="butt" font-size="11px" transform="translate(367,112)" fill-opacity="1" fill="black" text-rendering="geometricPrecision" image-rendering="optimizeQuality" font-family="sans-serif" stroke-linejoin="round" stroke="black" stroke-opacity="1"
    ><line y2="188" fill="none" x1="50" clip-path="url(#clipPath11)" x2="50" y1="50"
      /><line y2="176" fill="none" x1="50" clip-path="url(#clipPath11)" x2="56" y1="188"
      /><line y2="176" fill="none" x1="50" clip-path="url(#clipPath11)" x2="44" y1="188"
    /></g
    ><g stroke-linecap="butt" font-size="11px" transform="translate(346,339)" fill-opacity="1" fill="black" text-rendering="geometricPrecision" image-rendering="optimizeQuality" font-family="sans-serif" stroke-linejoin="round" stroke="black" stroke-opacity="1"
    ><line y2="188" fill="none" x1="50" clip-path="url(#clipPath12)" x2="50" y1="50"
      /><line y2="176" fill="none" x1="50" clip-path="url(#clipPath12)" x2="56" y1="188"
      /><line y2="176" fill="none" x1="50" clip-path="url(#clipPath12)" x2="44" y1="188"
    /></g
    ><g stroke-linecap="butt" font-size="11px" transform="translate(209,112)" fill-opacity="1" fill="black" text-rendering="geometricPrecision" image-rendering="optimizeQuality" font-family="sans-serif" stroke-linejoin="round" stroke="black" stroke-opacity="1"
    ><line y2="50" fill="none" x1="50" clip-path="url(#clipPath13)" x2="50" y1="188"
      /><line y2="62" fill="none" x1="50" clip-path="url(#clipPath13)" x2="44" y1="50"
      /><line y2="62" fill="none" x1="50" clip-path="url(#clipPath13)" x2="56" y1="50"
    /></g
    ><g stroke-linecap="butt" font-size="11px" transform="translate(129,112)" fill-opacity="1" fill="black" text-rendering="geometricPrecision" image-rendering="optimizeQuality" font-family="sans-serif" stroke-linejoin="round" stroke="black" stroke-opacity="1"
    ><line y2="50" fill="none" x1="50" clip-path="url(#clipPath15)" x2="50" y1="415"
      /><line y2="62" fill="none" x1="50" clip-path="url(#clipPath15)" x2="44" y1="50"
      /><line y2="62" fill="none" x1="50" clip-path="url(#clipPath15)" x2="56" y1="50"
    /></g
    ><g stroke-linecap="butt" font-size="11px" transform="translate(262,2)" fill-opacity="1" fill="black" text-rendering="geometricPrecision" image-rendering="optimizeQuality" font-family="sans-serif" stroke-linejoin="round" stroke="black" stroke-opacity="1"
    ><line y2="83" fill="none" x1="50" clip-path="url(#clipPath17)" x2="50" y1="50"
      /><line y2="71" fill="none" x1="50" clip-path="url(#clipPath17)" x2="56" y1="83"
      /><line y2="71" fill="none" x1="50" clip-path="url(#clipPath17)" x2="44" y1="83"
    /></g
    ><g font-size="11px" transform="translate(12,333)" fill-opacity="1" fill="black" text-rendering="geometricPrecision" image-rendering="optimizeQuality" font-family="sans-serif" stroke="black" stroke-opacity="1"
    ><text x="15" xml:space="preserve" y="12" clip-path="url(#clipPath18)" stroke="none"
      >v_veh &lt;= v_target - v_neg ||</text
      ><text x="92" xml:space="preserve" y="27" clip-path="url(#clipPath18)" stroke="none"
      >P_brake &gt; 0</text
    ></g
    ><g font-size="11px" transform="translate(264,175)" fill-opacity="1" fill="black" text-rendering="geometricPrecision" image-rendering="optimizeQuality" font-family="sans-serif" stroke="black" stroke-opacity="1"
    ><text x="5" xml:space="preserve" y="12" clip-path="url(#clipPath19)" stroke="none"
      >slope &gt;= 0 ||</text
      ><text x="5" xml:space="preserve" y="27" clip-path="url(#clipPath19)" stroke="none"
      >v_veh &lt;= v_min ||</text
      ><text x="5" xml:space="preserve" y="42" clip-path="url(#clipPath19)" stroke="none"
      >v_veh &lt;= v_target</text
      ><text x="5" xml:space="preserve" y="57" clip-path="url(#clipPath19)" stroke="none"
      >a_veh,est &lt; 0 ||</text
      ><text x="5" xml:space="preserve" y="72" clip-path="url(#clipPath19)" stroke="none"
      >a_veh,est &gt; 0.1 ||</text
      ><text x="5" xml:space="preserve" y="87" clip-path="url(#clipPath19)" stroke="none"
      >P_brake &gt; 0 ||</text
      ><text x="5" xml:space="preserve" y="102" clip-path="url(#clipPath19)" stroke="none"
      >P_ice_out &gt; P_ice_drag</text
    ></g
    ><g font-size="11px" transform="translate(412,394)" fill-opacity="1" fill="black" text-rendering="geometricPrecision" image-rendering="optimizeQuality" font-family="sans-serif" stroke="black" stroke-opacity="1"
    ><text x="5" xml:space="preserve" y="12" clip-path="url(#clipPath20)" stroke="none"
      >slope &lt; 0 &amp;&amp;</text
      ><text x="5" xml:space="preserve" y="27" clip-path="url(#clipPath20)" stroke="none"
      >v_veh &gt; v_min &amp;&amp;</text
      ><text x="5" xml:space="preserve" y="42" clip-path="url(#clipPath20)" stroke="none"
      >v_veh &gt;= v_target &amp;&amp;</text
      ><text x="5" xml:space="preserve" y="57" clip-path="url(#clipPath20)" stroke="none"
      >v_veh &lt;= v_target + v_overspeed - 2 km/h</text
      ><text x="5" xml:space="preserve" y="72" clip-path="url(#clipPath20)" stroke="none"
      >a_veh,est &gt;= 0 &amp;&amp;</text
      ><text x="5" xml:space="preserve" y="87" clip-path="url(#clipPath20)" stroke="none"
      >a_veh,est &lt;= 0.1 &amp;&amp;</text
      ><text x="5" xml:space="preserve" y="102" clip-path="url(#clipPath20)" stroke="none"
      >P_brake = 0 &amp;&amp;</text
      ><text x="5" xml:space="preserve" y="117" clip-path="url(#clipPath20)" stroke="none"
      >P_ice_out = P_ice_drag</text
    ></g
    ><g font-size="11px" transform="translate(442,172)" fill-opacity="1" fill="black" text-rendering="geometricPrecision" image-rendering="optimizeQuality" font-family="sans-serif" stroke="black" stroke-opacity="1"
    ><text x="5" xml:space="preserve" y="12" clip-path="url(#clipPath20)" stroke="none"
      >slope &lt; 0 &amp;&amp;</text
      ><text x="5" xml:space="preserve" y="27" clip-path="url(#clipPath20)" stroke="none"
      >v_veh &gt; v_min &amp;&amp;</text
      ><text x="5" xml:space="preserve" y="42" clip-path="url(#clipPath20)" stroke="none"
      >v_veh &gt;= v_target &amp;&amp;</text
      ><text x="5" xml:space="preserve" y="57" clip-path="url(#clipPath20)" stroke="none"
      >v_veh &lt;= v_target + v_overspeed - 2 km/h</text
      ><text x="5" xml:space="preserve" y="72" clip-path="url(#clipPath20)" stroke="none"
      >a_veh,est &gt;= 0 &amp;&amp;</text
      ><text x="5" xml:space="preserve" y="87" clip-path="url(#clipPath20)" stroke="none"
      >a_veh,est &lt;= 0.1 &amp;&amp;</text
      ><text x="5" xml:space="preserve" y="102" clip-path="url(#clipPath20)" stroke="none"
      >P_brake = 0 &amp;&amp;</text
      ><text x="5" xml:space="preserve" y="117" clip-path="url(#clipPath20)" stroke="none"
      >P_ice_out = P_ice_drag</text
    ></g
    ></g
></svg
>
