<?xml version="1.0" encoding="UTF-8" standalone="no"?>
<!-- Created with Inkscape (http://www.inkscape.org/) -->

<svg
   xmlns:dc="http://purl.org/dc/elements/1.1/"
   xmlns:cc="http://creativecommons.org/ns#"
   xmlns:rdf="http://www.w3.org/1999/02/22-rdf-syntax-ns#"
   xmlns:svg="http://www.w3.org/2000/svg"
   xmlns="http://www.w3.org/2000/svg"
   xmlns:sodipodi="http://sodipodi.sourceforge.net/DTD/sodipodi-0.dtd"
   xmlns:inkscape="http://www.inkscape.org/namespaces/inkscape"
   version="1.1"
   id="svg3680"
   xml:space="preserve"
   width="724.3916"
   height="321.80789"
   viewBox="0 0 724.3916 321.80789"
   sodipodi:docname="pto.svg"
   inkscape:version="0.92.0 r15299"><metadata
     id="metadata3686"><rdf:RDF><cc:Work
         rdf:about=""><dc:format>image/svg+xml</dc:format><dc:type
           rdf:resource="http://purl.org/dc/dcmitype/StillImage" /><dc:title></dc:title></cc:Work></rdf:RDF></metadata><defs
     id="defs3684"><clipPath
       clipPathUnits="userSpaceOnUse"
       id="clipPath3786"><path
         d="M 138.96,257.04 H 641.04 V 442.56 H 138.96 Z"
         id="path3784"
         inkscape:connector-curvature="0"
         style="clip-rule:evenodd" /></clipPath><clipPath
       clipPathUnits="userSpaceOnUse"
       id="clipPath3836"><path
         d="M 84.6,213.36 H 659.28 V 479.64 H 84.6 Z"
         id="path3834"
         inkscape:connector-curvature="0"
         style="clip-rule:evenodd" /></clipPath><clipPath
       clipPathUnits="userSpaceOnUse"
       id="clipPath3848"><path
         d="M 84.6,213.36 H 659.28 V 479.64 H 84.6 Z"
         id="path3846"
         inkscape:connector-curvature="0"
         style="clip-rule:evenodd" /></clipPath><clipPath
       clipPathUnits="userSpaceOnUse"
       id="clipPath3860"><path
         d="M 84.6,213.36 H 659.28 V 479.64 H 84.6 Z"
         id="path3858"
         inkscape:connector-curvature="0"
         style="clip-rule:evenodd" /></clipPath><clipPath
       clipPathUnits="userSpaceOnUse"
       id="clipPath3872"><path
         d="M 84.6,213.36 H 659.28 V 479.64 H 84.6 Z"
         id="path3870"
         inkscape:connector-curvature="0"
         style="clip-rule:evenodd" /></clipPath><clipPath
       clipPathUnits="userSpaceOnUse"
       id="clipPath3884"><path
         d="M 84.6,213.36 H 659.28 V 479.64 H 84.6 Z"
         id="path3882"
         inkscape:connector-curvature="0"
         style="clip-rule:evenodd" /></clipPath><clipPath
       clipPathUnits="userSpaceOnUse"
       id="clipPath3896"><path
         d="M 84.6,213.36 H 659.28 V 479.64 H 84.6 Z"
         id="path3894"
         inkscape:connector-curvature="0"
         style="clip-rule:evenodd" /></clipPath><clipPath
       clipPathUnits="userSpaceOnUse"
       id="clipPath3908"><path
         d="M 84.6,213.36 H 659.28 V 479.64 H 84.6 Z"
         id="path3906"
         inkscape:connector-curvature="0"
         style="clip-rule:evenodd" /></clipPath><clipPath
       clipPathUnits="userSpaceOnUse"
       id="clipPath3920"><path
         d="M 84.6,213.36 H 659.28 V 479.64 H 84.6 Z"
         id="path3918"
         inkscape:connector-curvature="0"
         style="clip-rule:evenodd" /></clipPath><clipPath
       clipPathUnits="userSpaceOnUse"
       id="clipPath3932"><path
         d="M 84.6,213.36 H 659.28 V 479.64 H 84.6 Z"
         id="path3930"
         inkscape:connector-curvature="0"
         style="clip-rule:evenodd" /></clipPath><clipPath
       clipPathUnits="userSpaceOnUse"
       id="clipPath3944"><path
         d="M 84.6,213.36 H 659.28 V 479.64 H 84.6 Z"
         id="path3942"
         inkscape:connector-curvature="0"
         style="clip-rule:evenodd" /></clipPath><clipPath
       clipPathUnits="userSpaceOnUse"
       id="clipPath3956"><path
         d="M 84.6,213.36 H 659.28 V 479.64 H 84.6 Z"
         id="path3954"
         inkscape:connector-curvature="0"
         style="clip-rule:evenodd" /></clipPath><clipPath
       clipPathUnits="userSpaceOnUse"
       id="clipPath3968"><path
         d="M 84.6,213.36 H 659.28 V 479.64 H 84.6 Z"
         id="path3966"
         inkscape:connector-curvature="0"
         style="clip-rule:evenodd" /></clipPath><clipPath
       clipPathUnits="userSpaceOnUse"
       id="clipPath3980"><path
         d="M 84.6,213.36 H 659.28 V 479.64 H 84.6 Z"
         id="path3978"
         inkscape:connector-curvature="0"
         style="clip-rule:evenodd" /></clipPath><clipPath
       clipPathUnits="userSpaceOnUse"
       id="clipPath3992"><path
         d="M 84.6,213.36 H 659.28 V 479.64 H 84.6 Z"
         id="path3990"
         inkscape:connector-curvature="0"
         style="clip-rule:evenodd" /></clipPath><clipPath
       clipPathUnits="userSpaceOnUse"
       id="clipPath4004"><path
         d="M 84.6,213.36 H 659.28 V 479.64 H 84.6 Z"
         id="path4002"
         inkscape:connector-curvature="0"
         style="clip-rule:evenodd" /></clipPath><clipPath
       clipPathUnits="userSpaceOnUse"
       id="clipPath4016"><path
         d="M 84.6,213.36 H 659.28 V 479.64 H 84.6 Z"
         id="path4014"
         inkscape:connector-curvature="0"
         style="clip-rule:evenodd" /></clipPath><clipPath
       clipPathUnits="userSpaceOnUse"
       id="clipPath4028"><path
         d="M 84.6,213.36 H 659.28 V 479.64 H 84.6 Z"
         id="path4026"
         inkscape:connector-curvature="0"
         style="clip-rule:evenodd" /></clipPath><clipPath
       clipPathUnits="userSpaceOnUse"
       id="clipPath4040"><path
         d="M 84.6,213.36 H 659.28 V 479.64 H 84.6 Z"
         id="path4038"
         inkscape:connector-curvature="0"
         style="clip-rule:evenodd" /></clipPath><clipPath
       clipPathUnits="userSpaceOnUse"
       id="clipPath4052"><path
         d="M 84.6,213.36 H 659.28 V 479.64 H 84.6 Z"
         id="path4050"
         inkscape:connector-curvature="0"
         style="clip-rule:evenodd" /></clipPath><clipPath
       clipPathUnits="userSpaceOnUse"
       id="clipPath4064"><path
         d="M 84.6,213.36 H 659.28 V 479.64 H 84.6 Z"
         id="path4062"
         inkscape:connector-curvature="0"
         style="clip-rule:evenodd" /></clipPath><clipPath
       clipPathUnits="userSpaceOnUse"
       id="clipPath4076"><path
         d="M 84.6,213.36 H 659.28 V 479.64 H 84.6 Z"
         id="path4074"
         inkscape:connector-curvature="0"
         style="clip-rule:evenodd" /></clipPath><clipPath
       clipPathUnits="userSpaceOnUse"
       id="clipPath4088"><path
         d="M 84.6,213.36 H 659.28 V 479.64 H 84.6 Z"
         id="path4086"
         inkscape:connector-curvature="0"
         style="clip-rule:evenodd" /></clipPath><clipPath
       clipPathUnits="userSpaceOnUse"
       id="clipPath4100"><path
         d="M 84.6,213.36 H 659.28 V 479.64 H 84.6 Z"
         id="path4098"
         inkscape:connector-curvature="0"
         style="clip-rule:evenodd" /></clipPath><clipPath
       clipPathUnits="userSpaceOnUse"
       id="clipPath4112"><path
         d="M 84.6,213.36 H 659.28 V 479.64 H 84.6 Z"
         id="path4110"
         inkscape:connector-curvature="0"
         style="clip-rule:evenodd" /></clipPath><clipPath
       clipPathUnits="userSpaceOnUse"
       id="clipPath4124"><path
         d="M 84.6,213.36 H 659.28 V 479.64 H 84.6 Z"
         id="path4122"
         inkscape:connector-curvature="0"
         style="clip-rule:evenodd" /></clipPath><clipPath
       clipPathUnits="userSpaceOnUse"
       id="clipPath4136"><path
         d="M 84.6,213.36 H 659.28 V 479.64 H 84.6 Z"
         id="path4134"
         inkscape:connector-curvature="0"
         style="clip-rule:evenodd" /></clipPath><clipPath
       clipPathUnits="userSpaceOnUse"
       id="clipPath4148"><path
         d="M 84.6,213.36 H 659.28 V 479.64 H 84.6 Z"
         id="path4146"
         inkscape:connector-curvature="0"
         style="clip-rule:evenodd" /></clipPath><clipPath
       clipPathUnits="userSpaceOnUse"
       id="clipPath4160"><path
         d="M 84.6,213.36 H 659.28 V 479.64 H 84.6 Z"
         id="path4158"
         inkscape:connector-curvature="0"
         style="clip-rule:evenodd" /></clipPath><clipPath
       clipPathUnits="userSpaceOnUse"
       id="clipPath4172"><path
         d="M 84.6,213.36 H 659.28 V 479.64 H 84.6 Z"
         id="path4170"
         inkscape:connector-curvature="0"
         style="clip-rule:evenodd" /></clipPath><clipPath
       clipPathUnits="userSpaceOnUse"
       id="clipPath4184"><path
         d="M 84.6,213.36 H 659.28 V 479.64 H 84.6 Z"
         id="path4182"
         inkscape:connector-curvature="0"
         style="clip-rule:evenodd" /></clipPath><clipPath
       clipPathUnits="userSpaceOnUse"
       id="clipPath4196"><path
         d="M 84.6,213.36 H 659.28 V 479.64 H 84.6 Z"
         id="path4194"
         inkscape:connector-curvature="0"
         style="clip-rule:evenodd" /></clipPath><clipPath
       clipPathUnits="userSpaceOnUse"
       id="clipPath4208"><path
         d="M 84.6,213.36 H 659.28 V 479.64 H 84.6 Z"
         id="path4206"
         inkscape:connector-curvature="0"
         style="clip-rule:evenodd" /></clipPath><clipPath
       clipPathUnits="userSpaceOnUse"
       id="clipPath4220"><path
         d="M 84.6,213.36 H 659.28 V 479.64 H 84.6 Z"
         id="path4218"
         inkscape:connector-curvature="0"
         style="clip-rule:evenodd" /></clipPath><clipPath
       clipPathUnits="userSpaceOnUse"
       id="clipPath4232"><path
         d="M 84.6,213.36 H 659.28 V 479.64 H 84.6 Z"
         id="path4230"
         inkscape:connector-curvature="0"
         style="clip-rule:evenodd" /></clipPath><clipPath
       clipPathUnits="userSpaceOnUse"
       id="clipPath4244"><path
         d="M 84.6,213.36 H 659.28 V 479.64 H 84.6 Z"
         id="path4242"
         inkscape:connector-curvature="0"
         style="clip-rule:evenodd" /></clipPath><clipPath
       clipPathUnits="userSpaceOnUse"
       id="clipPath4256"><path
         d="M 84.6,213.36 H 659.28 V 479.64 H 84.6 Z"
         id="path4254"
         inkscape:connector-curvature="0"
         style="clip-rule:evenodd" /></clipPath><clipPath
       clipPathUnits="userSpaceOnUse"
       id="clipPath4268"><path
         d="M 84.6,213.36 H 659.28 V 479.64 H 84.6 Z"
         id="path4266"
         inkscape:connector-curvature="0"
         style="clip-rule:evenodd" /></clipPath><clipPath
       clipPathUnits="userSpaceOnUse"
       id="clipPath4280"><path
         d="M 84.6,213.36 H 659.28 V 479.64 H 84.6 Z"
         id="path4278"
         inkscape:connector-curvature="0"
         style="clip-rule:evenodd" /></clipPath><clipPath
       clipPathUnits="userSpaceOnUse"
       id="clipPath4292"><path
         d="M 84.6,213.36 H 659.28 V 479.64 H 84.6 Z"
         id="path4290"
         inkscape:connector-curvature="0"
         style="clip-rule:evenodd" /></clipPath><clipPath
       clipPathUnits="userSpaceOnUse"
       id="clipPath4318"><path
         d="M 1.4305e-5,0 H 960.00001 V 540 H 1.4305e-5 Z"
         id="path4316"
         inkscape:connector-curvature="0"
         style="clip-rule:evenodd" /></clipPath><clipPath
       clipPathUnits="userSpaceOnUse"
       id="clipPath4334"><path
         d="M 1.4305e-5,0 H 960.00001 V 540 H 1.4305e-5 Z"
         id="path4332"
         inkscape:connector-curvature="0"
         style="clip-rule:evenodd" /></clipPath><clipPath
       clipPathUnits="userSpaceOnUse"
       id="clipPath4350"><path
         d="M 1.4305e-5,0 H 960.00001 V 540 H 1.4305e-5 Z"
         id="path4348"
         inkscape:connector-curvature="0"
         style="clip-rule:evenodd" /></clipPath><clipPath
       clipPathUnits="userSpaceOnUse"
       id="clipPath4366"><path
         d="M 1.4305e-5,0 H 960.00001 V 540 H 1.4305e-5 Z"
         id="path4364"
         inkscape:connector-curvature="0"
         style="clip-rule:evenodd" /></clipPath><clipPath
       clipPathUnits="userSpaceOnUse"
       id="clipPath4382"><path
         d="M 1.4305e-5,0 H 960.00001 V 540 H 1.4305e-5 Z"
         id="path4380"
         inkscape:connector-curvature="0"
         style="clip-rule:evenodd" /></clipPath><clipPath
       clipPathUnits="userSpaceOnUse"
       id="clipPath4394"><path
         d="M 1.4305e-5,0 H 960.00001 V 540 H 1.4305e-5 Z"
         id="path4392"
         inkscape:connector-curvature="0"
         style="clip-rule:evenodd" /></clipPath><clipPath
       clipPathUnits="userSpaceOnUse"
       id="clipPath4406"><path
         d="M 1.4305e-5,0 H 960.00001 V 540 H 1.4305e-5 Z"
         id="path4404"
         inkscape:connector-curvature="0"
         style="clip-rule:evenodd" /></clipPath><clipPath
       clipPathUnits="userSpaceOnUse"
       id="clipPath4418"><path
         d="M 1.4305e-5,0 H 960.00001 V 540 H 1.4305e-5 Z"
         id="path4416"
         inkscape:connector-curvature="0"
         style="clip-rule:evenodd" /></clipPath><clipPath
       clipPathUnits="userSpaceOnUse"
       id="clipPath4430"><path
         d="M 1.4305e-5,0 H 960.00001 V 540 H 1.4305e-5 Z"
         id="path4428"
         inkscape:connector-curvature="0"
         style="clip-rule:evenodd" /></clipPath><clipPath
       clipPathUnits="userSpaceOnUse"
       id="clipPath4442"><path
         d="M 1.4305e-5,0 H 960.00001 V 540 H 1.4305e-5 Z"
         id="path4440"
         inkscape:connector-curvature="0"
         style="clip-rule:evenodd" /></clipPath></defs><sodipodi:namedview
     pagecolor="#ffffff"
     bordercolor="#666666"
     borderopacity="1"
     objecttolerance="10"
     gridtolerance="10"
     guidetolerance="10"
     inkscape:pageopacity="0"
     inkscape:pageshadow="2"
     inkscape:window-width="1920"
     inkscape:window-height="1138"
     id="namedview3682"
     showgrid="false"
     fit-margin-top="0"
     fit-margin-left="0"
     fit-margin-right="0"
     fit-margin-bottom="0"
     inkscape:zoom="1.2847222"
     inkscape:cx="506.83165"
     inkscape:cy="88.596809"
     inkscape:window-x="-8"
     inkscape:window-y="-8"
     inkscape:window-maximized="1"
     inkscape:current-layer="g3688" /><g
     id="g3688"
     inkscape:groupmode="layer"
     inkscape:label="pto behavior"
     transform="matrix(1.3333333,0,0,-1.3333333,-133.16835,624.34621)"><path
       d="M 138.96,280.8 H 640.32 M 138.96,303.84 H 640.32 M 138.96,327 H 640.32 M 138.96,350.04 H 640.32 M 138.96,373.2 H 640.32 M 138.96,396.24 H 640.32 M 138.96,419.4 h 501.36 m -501.36,23.04 h 501.36"
       style="fill:none;stroke:#d9d9d9;stroke-width:0.72000003;stroke-linecap:butt;stroke-linejoin:round;stroke-miterlimit:10;stroke-dasharray:none;stroke-opacity:1"
       id="path3700"
       inkscape:connector-curvature="0" /><path
       d="m 161.28,442.44 v -184.8 m 22.32,184.8 v -184.8 m 22.2,184.8 v -184.8 m 22.32,184.8 v -184.8 m 22.32,184.8 v -184.8 m 22.2,184.8 v -184.8 m 22.32,184.8 v -184.8 m 22.32,184.8 v -184.8 m 22.2,184.8 v -184.8 m 22.32,184.8 v -184.8 m 22.32,184.8 v -184.8 m 22.2,184.8 v -184.8 m 22.32,184.8 v -184.8 m 22.32,184.8 v -184.8 m 22.2,184.8 v -184.8 m 22.32,184.8 v -184.8 m 22.32,184.8 v -184.8 m 22.32,184.8 v -184.8 m 22.2,184.8 v -184.8 m 22.32,184.8 v -184.8 m 22.32,184.8 v -184.8 m 22.2,184.8 v -184.8"
       style="fill:none;stroke:#d9d9d9;stroke-width:0.72000003;stroke-linecap:butt;stroke-linejoin:round;stroke-miterlimit:10;stroke-dasharray:none;stroke-opacity:1"
       id="path3702"
       inkscape:connector-curvature="0" /><path
       d="m 138.96,257.64 v 184.8"
       style="fill:none;stroke:#bfbfbf;stroke-width:0.72000003;stroke-linecap:butt;stroke-linejoin:round;stroke-miterlimit:10;stroke-dasharray:none;stroke-opacity:1"
       id="path3704"
       inkscape:connector-curvature="0" /><path
       d="M 138.96,257.64 H 640.32"
       style="fill:none;stroke:#bfbfbf;stroke-width:0.72000003;stroke-linecap:butt;stroke-linejoin:round;stroke-miterlimit:10;stroke-dasharray:none;stroke-opacity:1"
       id="path3706"
       inkscape:connector-curvature="0" /><g
       id="g3708"><path
         d="m 350.7,280.74 11.16,30.12"
         style="fill:none;stroke:#a5a5a5;stroke-width:1.55999994;stroke-linecap:round;stroke-linejoin:round;stroke-miterlimit:10;stroke-dasharray:4.68, 6.24;stroke-dashoffset:0;stroke-opacity:1"
         id="path3710"
         inkscape:connector-curvature="0" /></g><g
       id="g3712"><path
         d="m 361.86,310.86 22.2,60"
         style="fill:none;stroke:#a5a5a5;stroke-width:1.55999994;stroke-linecap:round;stroke-linejoin:round;stroke-miterlimit:10;stroke-dasharray:4.68, 6.24;stroke-dashoffset:0;stroke-opacity:1"
         id="path3714"
         inkscape:connector-curvature="0" /></g><path
       d="m 473.22,370.86 22.32,-18.12"
       style="fill:none;stroke:#a5a5a5;stroke-width:1.55999994;stroke-linecap:round;stroke-linejoin:round;stroke-miterlimit:10;stroke-dasharray:none;stroke-opacity:1"
       id="path3716"
       inkscape:connector-curvature="0" /><path
       d="m 217.02,353.7 33.36,-69.36 44.64,-3.6 h 55.68 m 144.84,72 44.52,-45.12 55.68,-26.88"
       style="fill:none;stroke:#a5a5a5;stroke-width:1.55999994;stroke-linecap:round;stroke-linejoin:round;stroke-miterlimit:10;stroke-dasharray:none;stroke-opacity:1"
       id="path3718"
       inkscape:connector-curvature="0" /><path
       d="m 219.45,353.67 c 0,-1.4 -1.13,-2.52 -2.52,-2.52 -1.39,0 -2.52,1.12 -2.52,2.52 0,1.39 1.13,2.52 2.52,2.52 1.39,0 2.52,-1.13 2.52,-2.52 z"
       style="fill:#a5a5a5;fill-opacity:1;fill-rule:nonzero;stroke:none"
       id="path3720"
       inkscape:connector-curvature="0" /><path
       d="m 219.45,353.67 c 0,-1.4 -1.13,-2.52 -2.52,-2.52 -1.39,0 -2.52,1.12 -2.52,2.52 0,1.39 1.13,2.52 2.52,2.52 1.39,0 2.52,-1.13 2.52,-2.52 z"
       style="fill:none;stroke:#a5a5a5;stroke-width:0.72000003;stroke-linecap:butt;stroke-linejoin:round;stroke-miterlimit:10;stroke-dasharray:none;stroke-opacity:1"
       id="path3722"
       inkscape:connector-curvature="0" /><path
       d="m 252.93,284.31 c 0,-1.4 -1.13,-2.52 -2.52,-2.52 -1.39,0 -2.52,1.12 -2.52,2.52 0,1.39 1.13,2.52 2.52,2.52 1.39,0 2.52,-1.13 2.52,-2.52 z"
       style="fill:#a5a5a5;fill-opacity:1;fill-rule:nonzero;stroke:none"
       id="path3724"
       inkscape:connector-curvature="0" /><path
       d="m 252.93,284.31 c 0,-1.4 -1.13,-2.52 -2.52,-2.52 -1.39,0 -2.52,1.12 -2.52,2.52 0,1.39 1.13,2.52 2.52,2.52 1.39,0 2.52,-1.13 2.52,-2.52 z"
       style="fill:none;stroke:#a5a5a5;stroke-width:0.72000003;stroke-linecap:butt;stroke-linejoin:round;stroke-miterlimit:10;stroke-dasharray:none;stroke-opacity:1"
       id="path3726"
       inkscape:connector-curvature="0" /><path
       d="m 297.45,280.83 c 0,-1.4 -1.13,-2.52 -2.52,-2.52 -1.39,0 -2.52,1.12 -2.52,2.52 0,1.39 1.13,2.52 2.52,2.52 1.39,0 2.52,-1.13 2.52,-2.52 z"
       style="fill:#a5a5a5;fill-opacity:1;fill-rule:nonzero;stroke:none"
       id="path3728"
       inkscape:connector-curvature="0" /><path
       d="m 297.45,280.83 c 0,-1.4 -1.13,-2.52 -2.52,-2.52 -1.39,0 -2.52,1.12 -2.52,2.52 0,1.39 1.13,2.52 2.52,2.52 1.39,0 2.52,-1.13 2.52,-2.52 z"
       style="fill:none;stroke:#a5a5a5;stroke-width:0.72000003;stroke-linecap:butt;stroke-linejoin:round;stroke-miterlimit:10;stroke-dasharray:none;stroke-opacity:1"
       id="path3730"
       inkscape:connector-curvature="0" /><path
       d="m 353.13,280.83 c 0,-1.4 -1.13,-2.52 -2.52,-2.52 -1.39,0 -2.52,1.12 -2.52,2.52 0,1.39 1.13,2.52 2.52,2.52 1.39,0 2.52,-1.13 2.52,-2.52 z"
       style="fill:#a5a5a5;fill-opacity:1;fill-rule:nonzero;stroke:none"
       id="path3732"
       inkscape:connector-curvature="0" /><path
       d="m 353.13,280.83 c 0,-1.4 -1.13,-2.52 -2.52,-2.52 -1.39,0 -2.52,1.12 -2.52,2.52 0,1.39 1.13,2.52 2.52,2.52 1.39,0 2.52,-1.13 2.52,-2.52 z"
       style="fill:none;stroke:#a5a5a5;stroke-width:0.72000003;stroke-linecap:butt;stroke-linejoin:round;stroke-miterlimit:10;stroke-dasharray:none;stroke-opacity:1"
       id="path3734"
       inkscape:connector-curvature="0" /><path
       d="m 475.65,370.95 c 0,-1.4 -1.13,-2.52 -2.52,-2.52 -1.39,0 -2.52,1.12 -2.52,2.52 0,1.39 1.13,2.52 2.52,2.52 1.39,0 2.52,-1.13 2.52,-2.52 z"
       style="fill:#a5a5a5;fill-opacity:1;fill-rule:nonzero;stroke:none"
       id="path3736"
       inkscape:connector-curvature="0" /><path
       d="m 475.65,370.95 c 0,-1.4 -1.13,-2.52 -2.52,-2.52 -1.39,0 -2.52,1.12 -2.52,2.52 0,1.39 1.13,2.52 2.52,2.52 1.39,0 2.52,-1.13 2.52,-2.52 z"
       style="fill:none;stroke:#a5a5a5;stroke-width:0.72000003;stroke-linecap:butt;stroke-linejoin:round;stroke-miterlimit:10;stroke-dasharray:none;stroke-opacity:1"
       id="path3738"
       inkscape:connector-curvature="0" /><path
       d="m 542.61,307.71 c 0,-1.4 -1.13,-2.52 -2.52,-2.52 -1.39,0 -2.52,1.12 -2.52,2.52 0,1.39 1.13,2.52 2.52,2.52 1.39,0 2.52,-1.13 2.52,-2.52 z"
       style="fill:#a5a5a5;fill-opacity:1;fill-rule:nonzero;stroke:none"
       id="path3740"
       inkscape:connector-curvature="0" /><path
       d="m 542.61,307.71 c 0,-1.4 -1.13,-2.52 -2.52,-2.52 -1.39,0 -2.52,1.12 -2.52,2.52 0,1.39 1.13,2.52 2.52,2.52 1.39,0 2.52,-1.13 2.52,-2.52 z"
       style="fill:none;stroke:#a5a5a5;stroke-width:0.72000003;stroke-linecap:butt;stroke-linejoin:round;stroke-miterlimit:10;stroke-dasharray:none;stroke-opacity:1"
       id="path3742"
       inkscape:connector-curvature="0" /><path
       d="m 598.29,280.83 c 0,-1.4 -1.13,-2.52 -2.52,-2.52 -1.39,0 -2.52,1.12 -2.52,2.52 0,1.39 1.13,2.52 2.52,2.52 1.39,0 2.52,-1.13 2.52,-2.52 z"
       style="fill:#a5a5a5;fill-opacity:1;fill-rule:nonzero;stroke:none"
       id="path3744"
       inkscape:connector-curvature="0" /><path
       d="m 598.29,280.83 c 0,-1.4 -1.13,-2.52 -2.52,-2.52 -1.39,0 -2.52,1.12 -2.52,2.52 0,1.39 1.13,2.52 2.52,2.52 1.39,0 2.52,-1.13 2.52,-2.52 z"
       style="fill:none;stroke:#a5a5a5;stroke-width:0.72000003;stroke-linecap:butt;stroke-linejoin:round;stroke-miterlimit:10;stroke-dasharray:none;stroke-opacity:1"
       id="path3746"
       inkscape:connector-curvature="0" /><path
       d="m 364.32,310.92 c 0,-1.39 -1.13,-2.52 -2.52,-2.52 -1.39,0 -2.52,1.13 -2.52,2.52 0,1.39 1.13,2.52 2.52,2.52 1.39,0 2.52,-1.13 2.52,-2.52 z"
       style="fill:#a5a5a5;fill-opacity:1;fill-rule:nonzero;stroke:none"
       id="path3748"
       inkscape:connector-curvature="0" /><path
       d="m 364.32,310.92 c 0,-1.39 -1.13,-2.52 -2.52,-2.52 -1.39,0 -2.52,1.13 -2.52,2.52 0,1.39 1.13,2.52 2.52,2.52 1.39,0 2.52,-1.13 2.52,-2.52 z"
       style="fill:none;stroke:#a5a5a5;stroke-width:0.72000003;stroke-linecap:butt;stroke-linejoin:round;stroke-miterlimit:10;stroke-dasharray:none;stroke-opacity:1"
       id="path3750"
       inkscape:connector-curvature="0" /><path
       d="m 498,352.8 c 0,-1.39 -1.13,-2.52 -2.52,-2.52 -1.39,0 -2.52,1.13 -2.52,2.52 0,1.39 1.13,2.52 2.52,2.52 1.39,0 2.52,-1.13 2.52,-2.52 z"
       style="fill:#a5a5a5;fill-opacity:1;fill-rule:nonzero;stroke:none"
       id="path3752"
       inkscape:connector-curvature="0" /><path
       d="m 498,352.8 c 0,-1.39 -1.13,-2.52 -2.52,-2.52 -1.39,0 -2.52,1.13 -2.52,2.52 0,1.39 1.13,2.52 2.52,2.52 1.39,0 2.52,-1.13 2.52,-2.52 z"
       style="fill:none;stroke:#a5a5a5;stroke-width:0.72000003;stroke-linecap:butt;stroke-linejoin:round;stroke-miterlimit:10;stroke-dasharray:none;stroke-opacity:1"
       id="path3754"
       inkscape:connector-curvature="0" /><path
       d="m 361.86,370.86 h 22.2 22.32 22.32 22.2 22.32"
       style="fill:none;stroke:#ed7d31;stroke-width:1.55999994;stroke-linecap:round;stroke-linejoin:round;stroke-miterlimit:10;stroke-dasharray:none;stroke-opacity:1"
       id="path3756"
       inkscape:connector-curvature="0" /><path
       d="m 365.94,366.78 -8.04,8.04 m 0,-8.04 8.04,8.04"
       style="fill:none;stroke:#ed7d31;stroke-width:1.79999995;stroke-linecap:butt;stroke-linejoin:round;stroke-miterlimit:10;stroke-dasharray:none;stroke-opacity:1"
       id="path3758"
       inkscape:connector-curvature="0" /><path
       d="m 386.61,370.95 c 0,-1.4 -1.13,-2.52 -2.52,-2.52 -1.39,0 -2.52,1.12 -2.52,2.52 0,1.39 1.13,2.52 2.52,2.52 1.39,0 2.52,-1.13 2.52,-2.52 z"
       style="fill:#ed7d31;fill-opacity:1;fill-rule:nonzero;stroke:none"
       id="path3760"
       inkscape:connector-curvature="0" /><path
       d="m 386.61,370.95 c 0,-1.4 -1.13,-2.52 -2.52,-2.52 -1.39,0 -2.52,1.12 -2.52,2.52 0,1.39 1.13,2.52 2.52,2.52 1.39,0 2.52,-1.13 2.52,-2.52 z"
       style="fill:none;stroke:#ed7d31;stroke-width:0.72000003;stroke-linecap:butt;stroke-linejoin:round;stroke-miterlimit:10;stroke-dasharray:none;stroke-opacity:1"
       id="path3762"
       inkscape:connector-curvature="0" /><path
       d="m 408.81,370.95 c 0,-1.4 -1.13,-2.52 -2.52,-2.52 -1.39,0 -2.52,1.12 -2.52,2.52 0,1.39 1.13,2.52 2.52,2.52 1.39,0 2.52,-1.13 2.52,-2.52 z"
       style="fill:#ed7d31;fill-opacity:1;fill-rule:nonzero;stroke:none"
       id="path3764"
       inkscape:connector-curvature="0" /><path
       d="m 408.81,370.95 c 0,-1.4 -1.13,-2.52 -2.52,-2.52 -1.39,0 -2.52,1.12 -2.52,2.52 0,1.39 1.13,2.52 2.52,2.52 1.39,0 2.52,-1.13 2.52,-2.52 z"
       style="fill:none;stroke:#ed7d31;stroke-width:0.72000003;stroke-linecap:butt;stroke-linejoin:round;stroke-miterlimit:10;stroke-dasharray:none;stroke-opacity:1"
       id="path3766"
       inkscape:connector-curvature="0" /><path
       d="m 431.13,370.95 c 0,-1.4 -1.13,-2.52 -2.52,-2.52 -1.39,0 -2.52,1.12 -2.52,2.52 0,1.39 1.13,2.52 2.52,2.52 1.39,0 2.52,-1.13 2.52,-2.52 z"
       style="fill:#ed7d31;fill-opacity:1;fill-rule:nonzero;stroke:none"
       id="path3768"
       inkscape:connector-curvature="0" /><path
       d="m 431.13,370.95 c 0,-1.4 -1.13,-2.52 -2.52,-2.52 -1.39,0 -2.52,1.12 -2.52,2.52 0,1.39 1.13,2.52 2.52,2.52 1.39,0 2.52,-1.13 2.52,-2.52 z"
       style="fill:none;stroke:#ed7d31;stroke-width:0.72000003;stroke-linecap:butt;stroke-linejoin:round;stroke-miterlimit:10;stroke-dasharray:none;stroke-opacity:1"
       id="path3770"
       inkscape:connector-curvature="0" /><path
       d="m 453.45,370.95 c 0,-1.4 -1.13,-2.52 -2.52,-2.52 -1.39,0 -2.52,1.12 -2.52,2.52 0,1.39 1.13,2.52 2.52,2.52 1.39,0 2.52,-1.13 2.52,-2.52 z"
       style="fill:#ed7d31;fill-opacity:1;fill-rule:nonzero;stroke:none"
       id="path3772"
       inkscape:connector-curvature="0" /><path
       d="m 453.45,370.95 c 0,-1.4 -1.13,-2.52 -2.52,-2.52 -1.39,0 -2.52,1.12 -2.52,2.52 0,1.39 1.13,2.52 2.52,2.52 1.39,0 2.52,-1.13 2.52,-2.52 z"
       style="fill:none;stroke:#ed7d31;stroke-width:0.72000003;stroke-linecap:butt;stroke-linejoin:round;stroke-miterlimit:10;stroke-dasharray:none;stroke-opacity:1"
       id="path3774"
       inkscape:connector-curvature="0" /><path
       d="m 475.65,370.95 c 0,-1.4 -1.13,-2.52 -2.52,-2.52 -1.39,0 -2.52,1.12 -2.52,2.52 0,1.39 1.13,2.52 2.52,2.52 1.39,0 2.52,-1.13 2.52,-2.52 z"
       style="fill:#ed7d31;fill-opacity:1;fill-rule:nonzero;stroke:none"
       id="path3776"
       inkscape:connector-curvature="0" /><path
       d="m 475.65,370.95 c 0,-1.4 -1.13,-2.52 -2.52,-2.52 -1.39,0 -2.52,1.12 -2.52,2.52 0,1.39 1.13,2.52 2.52,2.52 1.39,0 2.52,-1.13 2.52,-2.52 z"
       style="fill:none;stroke:#ed7d31;stroke-width:0.72000003;stroke-linecap:butt;stroke-linejoin:round;stroke-miterlimit:10;stroke-dasharray:none;stroke-opacity:1"
       id="path3778"
       inkscape:connector-curvature="0" /><g
       id="g3780"><g
         id="g3782"
         clip-path="url(#clipPath3786)"><path
           d="m 150.18,280.74 22.2,49.08 11.16,57.6 11.16,20.4 22.32,-54.12 m 378.72,-72.96 11.16,49.08 11.16,57.6 11.16,17.88 11.16,15.24"
           style="fill:none;stroke:#5b9bd5;stroke-width:1.55999994;stroke-linecap:round;stroke-linejoin:round;stroke-miterlimit:10;stroke-dasharray:none;stroke-opacity:1"
           id="path3788"
           inkscape:connector-curvature="0" /></g></g><path
       d="m 152.61,280.83 c 0,-1.4 -1.13,-2.52 -2.52,-2.52 -1.39,0 -2.52,1.12 -2.52,2.52 0,1.39 1.13,2.52 2.52,2.52 1.39,0 2.52,-1.13 2.52,-2.52 z"
       style="fill:#5b9bd5;fill-opacity:1;fill-rule:nonzero;stroke:none"
       id="path3790"
       inkscape:connector-curvature="0" /><path
       d="m 152.61,280.83 c 0,-1.4 -1.13,-2.52 -2.52,-2.52 -1.39,0 -2.52,1.12 -2.52,2.52 0,1.39 1.13,2.52 2.52,2.52 1.39,0 2.52,-1.13 2.52,-2.52 z"
       style="fill:none;stroke:#5b9bd5;stroke-width:0.72000003;stroke-linecap:butt;stroke-linejoin:round;stroke-miterlimit:10;stroke-dasharray:none;stroke-opacity:1"
       id="path3792"
       inkscape:connector-curvature="0" /><path
       d="m 174.93,329.79 c 0,-1.4 -1.13,-2.52 -2.52,-2.52 -1.39,0 -2.52,1.12 -2.52,2.52 0,1.39 1.13,2.52 2.52,2.52 1.39,0 2.52,-1.13 2.52,-2.52 z"
       style="fill:#5b9bd5;fill-opacity:1;fill-rule:nonzero;stroke:none"
       id="path3794"
       inkscape:connector-curvature="0" /><path
       d="m 174.93,329.79 c 0,-1.4 -1.13,-2.52 -2.52,-2.52 -1.39,0 -2.52,1.12 -2.52,2.52 0,1.39 1.13,2.52 2.52,2.52 1.39,0 2.52,-1.13 2.52,-2.52 z"
       style="fill:none;stroke:#5b9bd5;stroke-width:0.72000003;stroke-linecap:butt;stroke-linejoin:round;stroke-miterlimit:10;stroke-dasharray:none;stroke-opacity:1"
       id="path3796"
       inkscape:connector-curvature="0" /><path
       d="m 186.09,387.51 c 0,-1.4 -1.13,-2.52 -2.52,-2.52 -1.39,0 -2.52,1.12 -2.52,2.52 0,1.39 1.13,2.52 2.52,2.52 1.39,0 2.52,-1.13 2.52,-2.52 z"
       style="fill:#5b9bd5;fill-opacity:1;fill-rule:nonzero;stroke:none"
       id="path3798"
       inkscape:connector-curvature="0" /><path
       d="m 186.09,387.51 c 0,-1.4 -1.13,-2.52 -2.52,-2.52 -1.39,0 -2.52,1.12 -2.52,2.52 0,1.39 1.13,2.52 2.52,2.52 1.39,0 2.52,-1.13 2.52,-2.52 z"
       style="fill:none;stroke:#5b9bd5;stroke-width:0.72000003;stroke-linecap:butt;stroke-linejoin:round;stroke-miterlimit:10;stroke-dasharray:none;stroke-opacity:1"
       id="path3800"
       inkscape:connector-curvature="0" /><path
       d="m 197.13,407.79 c 0,-1.4 -1.13,-2.52 -2.52,-2.52 -1.39,0 -2.52,1.12 -2.52,2.52 0,1.39 1.13,2.52 2.52,2.52 1.39,0 2.52,-1.13 2.52,-2.52 z"
       style="fill:#5b9bd5;fill-opacity:1;fill-rule:nonzero;stroke:none"
       id="path3802"
       inkscape:connector-curvature="0" /><path
       d="m 197.13,407.79 c 0,-1.4 -1.13,-2.52 -2.52,-2.52 -1.39,0 -2.52,1.12 -2.52,2.52 0,1.39 1.13,2.52 2.52,2.52 1.39,0 2.52,-1.13 2.52,-2.52 z"
       style="fill:none;stroke:#5b9bd5;stroke-width:0.72000003;stroke-linecap:butt;stroke-linejoin:round;stroke-miterlimit:10;stroke-dasharray:none;stroke-opacity:1"
       id="path3804"
       inkscape:connector-curvature="0" /><path
       d="m 219.45,353.67 c 0,-1.4 -1.13,-2.52 -2.52,-2.52 -1.39,0 -2.52,1.12 -2.52,2.52 0,1.39 1.13,2.52 2.52,2.52 1.39,0 2.52,-1.13 2.52,-2.52 z"
       style="fill:#5b9bd5;fill-opacity:1;fill-rule:nonzero;stroke:none"
       id="path3806"
       inkscape:connector-curvature="0" /><path
       d="m 219.45,353.67 c 0,-1.4 -1.13,-2.52 -2.52,-2.52 -1.39,0 -2.52,1.12 -2.52,2.52 0,1.39 1.13,2.52 2.52,2.52 1.39,0 2.52,-1.13 2.52,-2.52 z"
       style="fill:none;stroke:#5b9bd5;stroke-width:0.72000003;stroke-linecap:butt;stroke-linejoin:round;stroke-miterlimit:10;stroke-dasharray:none;stroke-opacity:1"
       id="path3808"
       inkscape:connector-curvature="0" /><path
       d="m 598.29,280.83 c 0,-1.4 -1.13,-2.52 -2.52,-2.52 -1.39,0 -2.52,1.12 -2.52,2.52 0,1.39 1.13,2.52 2.52,2.52 1.39,0 2.52,-1.13 2.52,-2.52 z"
       style="fill:#5b9bd5;fill-opacity:1;fill-rule:nonzero;stroke:none"
       id="path3810"
       inkscape:connector-curvature="0" /><path
       d="m 598.29,280.83 c 0,-1.4 -1.13,-2.52 -2.52,-2.52 -1.39,0 -2.52,1.12 -2.52,2.52 0,1.39 1.13,2.52 2.52,2.52 1.39,0 2.52,-1.13 2.52,-2.52 z"
       style="fill:none;stroke:#5b9bd5;stroke-width:0.72000003;stroke-linecap:butt;stroke-linejoin:round;stroke-miterlimit:10;stroke-dasharray:none;stroke-opacity:1"
       id="path3812"
       inkscape:connector-curvature="0" /><path
       d="m 609.45,329.79 c 0,-1.4 -1.13,-2.52 -2.52,-2.52 -1.39,0 -2.52,1.12 -2.52,2.52 0,1.39 1.13,2.52 2.52,2.52 1.39,0 2.52,-1.13 2.52,-2.52 z"
       style="fill:#5b9bd5;fill-opacity:1;fill-rule:nonzero;stroke:none"
       id="path3814"
       inkscape:connector-curvature="0" /><path
       d="m 609.45,329.79 c 0,-1.4 -1.13,-2.52 -2.52,-2.52 -1.39,0 -2.52,1.12 -2.52,2.52 0,1.39 1.13,2.52 2.52,2.52 1.39,0 2.52,-1.13 2.52,-2.52 z"
       style="fill:none;stroke:#5b9bd5;stroke-width:0.72000003;stroke-linecap:butt;stroke-linejoin:round;stroke-miterlimit:10;stroke-dasharray:none;stroke-opacity:1"
       id="path3816"
       inkscape:connector-curvature="0" /><path
       d="m 620.49,387.51 c 0,-1.4 -1.13,-2.52 -2.52,-2.52 -1.39,0 -2.52,1.12 -2.52,2.52 0,1.39 1.13,2.52 2.52,2.52 1.39,0 2.52,-1.13 2.52,-2.52 z"
       style="fill:#5b9bd5;fill-opacity:1;fill-rule:nonzero;stroke:none"
       id="path3818"
       inkscape:connector-curvature="0" /><path
       d="m 620.49,387.51 c 0,-1.4 -1.13,-2.52 -2.52,-2.52 -1.39,0 -2.52,1.12 -2.52,2.52 0,1.39 1.13,2.52 2.52,2.52 1.39,0 2.52,-1.13 2.52,-2.52 z"
       style="fill:none;stroke:#5b9bd5;stroke-width:0.72000003;stroke-linecap:butt;stroke-linejoin:round;stroke-miterlimit:10;stroke-dasharray:none;stroke-opacity:1"
       id="path3820"
       inkscape:connector-curvature="0" /><path
       d="m 631.65,405.39 c 0,-1.4 -1.13,-2.52 -2.52,-2.52 -1.39,0 -2.52,1.12 -2.52,2.52 0,1.39 1.13,2.52 2.52,2.52 1.39,0 2.52,-1.13 2.52,-2.52 z"
       style="fill:#5b9bd5;fill-opacity:1;fill-rule:nonzero;stroke:none"
       id="path3822"
       inkscape:connector-curvature="0" /><path
       d="m 631.65,405.39 c 0,-1.4 -1.13,-2.52 -2.52,-2.52 -1.39,0 -2.52,1.12 -2.52,2.52 0,1.39 1.13,2.52 2.52,2.52 1.39,0 2.52,-1.13 2.52,-2.52 z"
       style="fill:none;stroke:#5b9bd5;stroke-width:0.72000003;stroke-linecap:butt;stroke-linejoin:round;stroke-miterlimit:10;stroke-dasharray:none;stroke-opacity:1"
       id="path3824"
       inkscape:connector-curvature="0" /><path
       d="m 642.81,420.51 c 0,-1.4 -1.13,-2.52 -2.52,-2.52 -1.39,0 -2.52,1.12 -2.52,2.52 0,1.39 1.13,2.52 2.52,2.52 1.39,0 2.52,-1.13 2.52,-2.52 z"
       style="fill:#5b9bd5;fill-opacity:1;fill-rule:nonzero;stroke:none"
       id="path3826"
       inkscape:connector-curvature="0" /><path
       d="m 642.81,420.51 c 0,-1.4 -1.13,-2.52 -2.52,-2.52 -1.39,0 -2.52,1.12 -2.52,2.52 0,1.39 1.13,2.52 2.52,2.52 1.39,0 2.52,-1.13 2.52,-2.52 z"
       style="fill:none;stroke:#5b9bd5;stroke-width:0.72000003;stroke-linecap:butt;stroke-linejoin:round;stroke-miterlimit:10;stroke-dasharray:none;stroke-opacity:1"
       id="path3828"
       inkscape:connector-curvature="0" /><g
       id="g3830"><g
         id="g3832"
         clip-path="url(#clipPath3836)"><text
           transform="matrix(1,0,0,-1,116.98,255.12)"
           style="font-variant:normal;font-weight:normal;font-size:9.02400017px;font-family:Calibri;-inkscape-font-specification:Calibri;writing-mode:lr-tb;fill:#000000;fill-opacity:1;fill-rule:nonzero;stroke:none"
           id="text3840"><tspan
             x="0 4.559968 9.119936"
             y="0"
             sodipodi:role="line"
             id="tspan3838">500</tspan></text>
</g></g><g
       id="g3842"><g
         id="g3844"
         clip-path="url(#clipPath3848)"><text
           transform="matrix(1,0,0,-1,116.98,278.21)"
           style="font-variant:normal;font-weight:normal;font-size:9px;font-family:Calibri;-inkscape-font-specification:Calibri;writing-mode:lr-tb;fill:#000000;fill-opacity:1;fill-rule:nonzero;stroke:none"
           id="text3852"><tspan
             x="0 4.5599999 9.1199999"
             y="0"
             sodipodi:role="line"
             id="tspan3850">600</tspan></text>
</g></g><g
       id="g3854"><g
         id="g3856"
         clip-path="url(#clipPath3860)"><text
           transform="matrix(1,0,0,-1,116.98,301.3)"
           style="font-variant:normal;font-weight:normal;font-size:9px;font-family:Calibri;-inkscape-font-specification:Calibri;writing-mode:lr-tb;fill:#000000;fill-opacity:1;fill-rule:nonzero;stroke:none"
           id="text3864"><tspan
             x="0 4.5599999 9.1199999"
             y="0"
             sodipodi:role="line"
             id="tspan3862">700</tspan></text>
</g></g><g
       id="g3866"><g
         id="g3868"
         clip-path="url(#clipPath3872)"><text
           transform="matrix(1,0,0,-1,116.98,324.41)"
           style="font-variant:normal;font-weight:normal;font-size:9px;font-family:Calibri;-inkscape-font-specification:Calibri;writing-mode:lr-tb;fill:#000000;fill-opacity:1;fill-rule:nonzero;stroke:none"
           id="text3876"><tspan
             x="0 4.5599999 9.1199999"
             y="0"
             sodipodi:role="line"
             id="tspan3874">800</tspan></text>
</g></g><g
       id="g3878"><g
         id="g3880"
         clip-path="url(#clipPath3884)"><text
           transform="matrix(1,0,0,-1,116.98,347.5)"
           style="font-variant:normal;font-weight:normal;font-size:9px;font-family:Calibri;-inkscape-font-specification:Calibri;writing-mode:lr-tb;fill:#000000;fill-opacity:1;fill-rule:nonzero;stroke:none"
           id="text3888"><tspan
             x="0 4.5599999 9.1199999"
             y="0"
             sodipodi:role="line"
             id="tspan3886">900</tspan></text>
</g></g><g
       id="g3890"><g
         id="g3892"
         clip-path="url(#clipPath3896)"><text
           transform="matrix(1,0,0,-1,112.42,370.61)"
           style="font-variant:normal;font-weight:normal;font-size:9px;font-family:Calibri;-inkscape-font-specification:Calibri;writing-mode:lr-tb;fill:#000000;fill-opacity:1;fill-rule:nonzero;stroke:none"
           id="text3900"><tspan
             x="0 4.5599999 9.1199999 13.68"
             y="0"
             sodipodi:role="line"
             id="tspan3898">1000</tspan></text>
</g></g><g
       id="g3902"><g
         id="g3904"
         clip-path="url(#clipPath3908)"><text
           transform="matrix(1,0,0,-1,112.42,393.7)"
           style="font-variant:normal;font-weight:normal;font-size:9px;font-family:Calibri;-inkscape-font-specification:Calibri;writing-mode:lr-tb;fill:#000000;fill-opacity:1;fill-rule:nonzero;stroke:none"
           id="text3912"><tspan
             x="0 4.5599999 9.1199999 13.68"
             y="0"
             sodipodi:role="line"
             id="tspan3910">1100</tspan></text>
</g></g><g
       id="g3914"><g
         id="g3916"
         clip-path="url(#clipPath3920)"><text
           transform="matrix(1,0,0,-1,112.42,416.81)"
           style="font-variant:normal;font-weight:normal;font-size:9px;font-family:Calibri;-inkscape-font-specification:Calibri;writing-mode:lr-tb;fill:#000000;fill-opacity:1;fill-rule:nonzero;stroke:none"
           id="text3924"><tspan
             x="0 4.5599999 9.1199999 13.68"
             y="0"
             sodipodi:role="line"
             id="tspan3922">1200</tspan></text>
</g></g><g
       id="g3926"><g
         id="g3928"
         clip-path="url(#clipPath3932)"><text
           transform="matrix(1,0,0,-1,112.42,439.9)"
           style="font-variant:normal;font-weight:normal;font-size:9px;font-family:Calibri;-inkscape-font-specification:Calibri;writing-mode:lr-tb;fill:#000000;fill-opacity:1;fill-rule:nonzero;stroke:none"
           id="text3936"><tspan
             x="0 4.5599999 9.1199999 13.68"
             y="0"
             sodipodi:role="line"
             id="tspan3934">1300</tspan></text>
</g></g><g
       id="g3938"><g
         id="g3940"
         clip-path="url(#clipPath3944)"><text
           transform="matrix(1,0,0,-1,136.73,243.41)"
           style="font-variant:normal;font-weight:normal;font-size:9px;font-family:Calibri;-inkscape-font-specification:Calibri;writing-mode:lr-tb;fill:#000000;fill-opacity:1;fill-rule:nonzero;stroke:none"
           id="text3948"><tspan
             x="0"
             y="0"
             id="tspan3946">0</tspan></text>
</g></g><g
       id="g3950"><g
         id="g3952"
         clip-path="url(#clipPath3956)"><text
           transform="matrix(1,0,0,-1,159,243.41)"
           style="font-variant:normal;font-weight:normal;font-size:9px;font-family:Calibri;-inkscape-font-specification:Calibri;writing-mode:lr-tb;fill:#000000;fill-opacity:1;fill-rule:nonzero;stroke:none"
           id="text3960"><tspan
             x="0"
             y="0"
             id="tspan3958">1</tspan></text>
</g></g><g
       id="g3962"><g
         id="g3964"
         clip-path="url(#clipPath3968)"><text
           transform="matrix(1,0,0,-1,181.3,243.41)"
           style="font-variant:normal;font-weight:normal;font-size:9px;font-family:Calibri;-inkscape-font-specification:Calibri;writing-mode:lr-tb;fill:#000000;fill-opacity:1;fill-rule:nonzero;stroke:none"
           id="text3972"><tspan
             x="0"
             y="0"
             id="tspan3970">2</tspan></text>
</g></g><g
       id="g3974"><g
         id="g3976"
         clip-path="url(#clipPath3980)"><text
           transform="matrix(1,0,0,-1,203.57,243.41)"
           style="font-variant:normal;font-weight:normal;font-size:9px;font-family:Calibri;-inkscape-font-specification:Calibri;writing-mode:lr-tb;fill:#000000;fill-opacity:1;fill-rule:nonzero;stroke:none"
           id="text3984"><tspan
             x="0"
             y="0"
             id="tspan3982">3</tspan></text>
</g></g><g
       id="g3986"><g
         id="g3988"
         clip-path="url(#clipPath3992)"><text
           transform="matrix(1,0,0,-1,225.86,243.41)"
           style="font-variant:normal;font-weight:normal;font-size:9px;font-family:Calibri;-inkscape-font-specification:Calibri;writing-mode:lr-tb;fill:#000000;fill-opacity:1;fill-rule:nonzero;stroke:none"
           id="text3996"><tspan
             x="0"
             y="0"
             id="tspan3994">4</tspan></text>
</g></g><g
       id="g3998"><g
         id="g4000"
         clip-path="url(#clipPath4004)"><text
           transform="matrix(1,0,0,-1,248.14,243.41)"
           style="font-variant:normal;font-weight:normal;font-size:9px;font-family:Calibri;-inkscape-font-specification:Calibri;writing-mode:lr-tb;fill:#000000;fill-opacity:1;fill-rule:nonzero;stroke:none"
           id="text4008"><tspan
             x="0"
             y="0"
             id="tspan4006">5</tspan></text>
</g></g><g
       id="g4010"><g
         id="g4012"
         clip-path="url(#clipPath4016)"><text
           transform="matrix(1,0,0,-1,270.43,243.41)"
           style="font-variant:normal;font-weight:normal;font-size:9px;font-family:Calibri;-inkscape-font-specification:Calibri;writing-mode:lr-tb;fill:#000000;fill-opacity:1;fill-rule:nonzero;stroke:none"
           id="text4020"><tspan
             x="0"
             y="0"
             id="tspan4018">6</tspan></text>
</g></g><g
       id="g4022"><g
         id="g4024"
         clip-path="url(#clipPath4028)"><text
           transform="matrix(1,0,0,-1,292.7,243.41)"
           style="font-variant:normal;font-weight:normal;font-size:9px;font-family:Calibri;-inkscape-font-specification:Calibri;writing-mode:lr-tb;fill:#000000;fill-opacity:1;fill-rule:nonzero;stroke:none"
           id="text4032"><tspan
             x="0"
             y="0"
             id="tspan4030">7</tspan></text>
</g></g><g
       id="g4034"><g
         id="g4036"
         clip-path="url(#clipPath4040)"><text
           transform="matrix(1,0,0,-1,315,243.41)"
           style="font-variant:normal;font-weight:normal;font-size:9px;font-family:Calibri;-inkscape-font-specification:Calibri;writing-mode:lr-tb;fill:#000000;fill-opacity:1;fill-rule:nonzero;stroke:none"
           id="text4044"><tspan
             x="0"
             y="0"
             id="tspan4042">8</tspan></text>
</g></g><g
       id="g4046"><g
         id="g4048"
         clip-path="url(#clipPath4052)"><text
           transform="matrix(1,0,0,-1,337.27,243.41)"
           style="font-variant:normal;font-weight:normal;font-size:9px;font-family:Calibri;-inkscape-font-specification:Calibri;writing-mode:lr-tb;fill:#000000;fill-opacity:1;fill-rule:nonzero;stroke:none"
           id="text4056"><tspan
             x="0"
             y="0"
             id="tspan4054">9</tspan></text>
</g></g><g
       id="g4058"><g
         id="g4060"
         clip-path="url(#clipPath4064)"><text
           transform="matrix(1,0,0,-1,357.29,243.41)"
           style="font-variant:normal;font-weight:normal;font-size:9px;font-family:Calibri;-inkscape-font-specification:Calibri;writing-mode:lr-tb;fill:#000000;fill-opacity:1;fill-rule:nonzero;stroke:none"
           id="text4068"><tspan
             x="0 4.5599999"
             y="0"
             sodipodi:role="line"
             id="tspan4066">10</tspan></text>
</g></g><g
       id="g4070"><g
         id="g4072"
         clip-path="url(#clipPath4076)"><text
           transform="matrix(1,0,0,-1,379.58,243.41)"
           style="font-variant:normal;font-weight:normal;font-size:9px;font-family:Calibri;-inkscape-font-specification:Calibri;writing-mode:lr-tb;fill:#000000;fill-opacity:1;fill-rule:nonzero;stroke:none"
           id="text4080"><tspan
             x="0 4.5599999"
             y="0"
             sodipodi:role="line"
             id="tspan4078">11</tspan></text>
</g></g><g
       id="g4082"><g
         id="g4084"
         clip-path="url(#clipPath4088)"><text
           transform="matrix(1,0,0,-1,401.86,243.41)"
           style="font-variant:normal;font-weight:normal;font-size:9px;font-family:Calibri;-inkscape-font-specification:Calibri;writing-mode:lr-tb;fill:#000000;fill-opacity:1;fill-rule:nonzero;stroke:none"
           id="text4092"><tspan
             x="0 4.5599999"
             y="0"
             sodipodi:role="line"
             id="tspan4090">12</tspan></text>
</g></g><g
       id="g4094"><g
         id="g4096"
         clip-path="url(#clipPath4100)"><text
           transform="matrix(1,0,0,-1,424.15,243.41)"
           style="font-variant:normal;font-weight:normal;font-size:9px;font-family:Calibri;-inkscape-font-specification:Calibri;writing-mode:lr-tb;fill:#000000;fill-opacity:1;fill-rule:nonzero;stroke:none"
           id="text4104"><tspan
             x="0 4.5599999"
             y="0"
             sodipodi:role="line"
             id="tspan4102">13</tspan></text>
</g></g><g
       id="g4106"><g
         id="g4108"
         clip-path="url(#clipPath4112)"><text
           transform="matrix(1,0,0,-1,446.42,243.41)"
           style="font-variant:normal;font-weight:normal;font-size:9px;font-family:Calibri;-inkscape-font-specification:Calibri;writing-mode:lr-tb;fill:#000000;fill-opacity:1;fill-rule:nonzero;stroke:none"
           id="text4116"><tspan
             x="0 4.5599999"
             y="0"
             sodipodi:role="line"
             id="tspan4114">14</tspan></text>
</g></g><g
       id="g4118"><g
         id="g4120"
         clip-path="url(#clipPath4124)"><text
           transform="matrix(1,0,0,-1,468.72,243.41)"
           style="font-variant:normal;font-weight:normal;font-size:9px;font-family:Calibri;-inkscape-font-specification:Calibri;writing-mode:lr-tb;fill:#000000;fill-opacity:1;fill-rule:nonzero;stroke:none"
           id="text4128"><tspan
             x="0 4.5599999"
             y="0"
             sodipodi:role="line"
             id="tspan4126">15</tspan></text>
</g></g><g
       id="g4130"><g
         id="g4132"
         clip-path="url(#clipPath4136)"><text
           transform="matrix(1,0,0,-1,490.99,243.41)"
           style="font-variant:normal;font-weight:normal;font-size:9px;font-family:Calibri;-inkscape-font-specification:Calibri;writing-mode:lr-tb;fill:#000000;fill-opacity:1;fill-rule:nonzero;stroke:none"
           id="text4140"><tspan
             x="0 4.5599999"
             y="0"
             sodipodi:role="line"
             id="tspan4138">16</tspan></text>
</g></g><g
       id="g4142"><g
         id="g4144"
         clip-path="url(#clipPath4148)"><text
           transform="matrix(1,0,0,-1,513.29,243.41)"
           style="font-variant:normal;font-weight:normal;font-size:9px;font-family:Calibri;-inkscape-font-specification:Calibri;writing-mode:lr-tb;fill:#000000;fill-opacity:1;fill-rule:nonzero;stroke:none"
           id="text4152"><tspan
             x="0 4.5599999"
             y="0"
             sodipodi:role="line"
             id="tspan4150">17</tspan></text>
</g></g><g
       id="g4154"><g
         id="g4156"
         clip-path="url(#clipPath4160)"><text
           transform="matrix(1,0,0,-1,535.56,243.41)"
           style="font-variant:normal;font-weight:normal;font-size:9px;font-family:Calibri;-inkscape-font-specification:Calibri;writing-mode:lr-tb;fill:#000000;fill-opacity:1;fill-rule:nonzero;stroke:none"
           id="text4164"><tspan
             x="0 4.5599999"
             y="0"
             sodipodi:role="line"
             id="tspan4162">18</tspan></text>
</g></g><g
       id="g4166"><g
         id="g4168"
         clip-path="url(#clipPath4172)"><text
           transform="matrix(1,0,0,-1,557.86,243.41)"
           style="font-variant:normal;font-weight:normal;font-size:9px;font-family:Calibri;-inkscape-font-specification:Calibri;writing-mode:lr-tb;fill:#000000;fill-opacity:1;fill-rule:nonzero;stroke:none"
           id="text4176"><tspan
             x="0 4.5599999"
             y="0"
             sodipodi:role="line"
             id="tspan4174">19</tspan></text>
</g></g><g
       id="g4178"><g
         id="g4180"
         clip-path="url(#clipPath4184)"><text
           transform="matrix(1,0,0,-1,580.13,243.41)"
           style="font-variant:normal;font-weight:normal;font-size:9px;font-family:Calibri;-inkscape-font-specification:Calibri;writing-mode:lr-tb;fill:#000000;fill-opacity:1;fill-rule:nonzero;stroke:none"
           id="text4188"><tspan
             x="0 4.5599999"
             y="0"
             sodipodi:role="line"
             id="tspan4186">20</tspan></text>
</g></g><g
       id="g4190"><g
         id="g4192"
         clip-path="url(#clipPath4196)"><text
           transform="matrix(1,0,0,-1,602.42,243.41)"
           style="font-variant:normal;font-weight:normal;font-size:9px;font-family:Calibri;-inkscape-font-specification:Calibri;writing-mode:lr-tb;fill:#000000;fill-opacity:1;fill-rule:nonzero;stroke:none"
           id="text4200"><tspan
             x="0 4.5599999"
             y="0"
             sodipodi:role="line"
             id="tspan4198">21</tspan></text>
</g></g><g
       id="g4202"><g
         id="g4204"
         clip-path="url(#clipPath4208)"><text
           transform="matrix(1,0,0,-1,624.7,243.41)"
           style="font-variant:normal;font-weight:normal;font-size:9px;font-family:Calibri;-inkscape-font-specification:Calibri;writing-mode:lr-tb;fill:#000000;fill-opacity:1;fill-rule:nonzero;stroke:none"
           id="text4212"><tspan
             x="0 4.5599999"
             y="0"
             sodipodi:role="line"
             id="tspan4210">22</tspan></text>
</g></g><g
       id="g4214"><g
         id="g4216"
         clip-path="url(#clipPath4220)"><text
           transform="matrix(-4.4e-8,1,1,4.4e-8,106.68,310.49)"
           style="font-variant:normal;font-weight:normal;font-size:9.96000004px;font-family:Calibri;-inkscape-font-specification:Calibri;writing-mode:lr-tb;fill:#000000;fill-opacity:1;fill-rule:nonzero;stroke:none"
           id="text4224"><tspan
             x="0 4.9202399 10.18908 14.88024 17.17104 22.40004 27.360121 29.740561 33.585121 38.853958 43.7742 48.694439 53.96328 56.35368 59.351639 62.827679 68.106483 76.024681"
             y="0"
             sodipodi:role="line"
             id="tspan4222">engine speed [rpm]</tspan></text>
</g></g><g
       id="g4226"><g
         id="g4228"
         clip-path="url(#clipPath4232)"><text
           transform="matrix(1,0,0,-1,374.3,228.46)"
           style="font-variant:normal;font-weight:normal;font-size:9.96000004px;font-family:Calibri;-inkscape-font-specification:Calibri;writing-mode:lr-tb;fill:#000000;fill-opacity:1;fill-rule:nonzero;stroke:none"
           id="text4236"><tspan
             x="0 3.3366001 5.6273999 13.58544 18.4758 20.866199 23.864161 27.708719"
             y="0"
             sodipodi:role="line"
             id="tspan4234">time [s]</tspan></text>
</g></g><g
       id="g4238"><g
         id="g4240"
         clip-path="url(#clipPath4244)"><text
           transform="matrix(1,0,0,-1,272.38,458.71)"
           style="font-variant:normal;font-weight:normal;font-size:14.03999996px;font-family:Calibri;-inkscape-font-specification:Calibri;writing-mode:lr-tb;fill:#000000;fill-opacity:1;fill-rule:nonzero;stroke:none"
           id="text4248"><tspan
             x="0 8.6345997 13.53456 16.76376 23.15196 26.381161 33.752159"
             y="0"
             sodipodi:role="line"
             id="tspan4246">Driving</tspan></text>
</g></g><g
       id="g4250"><g
         id="g4252"
         clip-path="url(#clipPath4256)"><text
           transform="matrix(1,0,0,-1,315.72,458.71)"
           style="font-variant:normal;font-weight:normal;font-size:14.03999996px;font-family:Calibri;-inkscape-font-specification:Calibri;writing-mode:lr-tb;fill:#000000;fill-opacity:1;fill-rule:nonzero;stroke:none"
           id="text4260"><tspan
             x="0 7.6658401 14.65776 21.944521 28.431 34.777081 38.006279 45.461521"
             y="0"
             sodipodi:role="line"
             id="tspan4258">Behavior</tspan></text>
</g></g><g
       id="g4262"><g
         id="g4264"
         clip-path="url(#clipPath4268)"><text
           transform="matrix(1,0,0,-1,369.12,458.71)"
           style="font-variant:normal;font-weight:normal;font-size:14.03999996px;font-family:Calibri;-inkscape-font-specification:Calibri;writing-mode:lr-tb;fill:#000000;fill-opacity:1;fill-rule:nonzero;stroke:none"
           id="text4272"><tspan
             x="0 8.6345997 15.96348 20.86344 24.09264 31.46364"
             y="0"
             sodipodi:role="line"
             id="tspan4270">During</tspan></text>
</g></g><g
       id="g4274"><g
         id="g4276"
         clip-path="url(#clipPath4280)"><text
           transform="matrix(1,0,0,-1,410.28,458.71)"
           style="font-variant:normal;font-weight:normal;font-size:14.03999996px;font-family:Calibri;-inkscape-font-specification:Calibri;writing-mode:lr-tb;fill:#000000;fill-opacity:1;fill-rule:nonzero;stroke:none"
           id="text4284"><tspan
             x="0 7.2025199 13.689 22.92732"
             y="0"
             sodipodi:role="line"
             id="tspan4282">PTO </tspan></text>
</g></g><g
       id="g4286"><g
         id="g4288"
         clip-path="url(#clipPath4292)"><text
           transform="matrix(1,0,0,-1,436.32,458.71)"
           style="font-variant:normal;font-weight:normal;font-size:14.03999996px;font-family:Calibri;-inkscape-font-specification:Calibri;writing-mode:lr-tb;fill:#000000;fill-opacity:1;fill-rule:nonzero;stroke:none"
           id="text4296"><tspan
             x="0 7.4411998 13.67496 19.55772 22.786921 29.778839"
             y="0"
             sodipodi:role="line"
             id="tspan4294">Cycles</tspan></text>
</g></g><path
       d="m 474.12,258.12 h 123 v 184.56 h -123 z"
       style="fill:#a5a5a5;fill-opacity:0.30196001;fill-rule:evenodd;stroke:none"
       id="path4298"
       inkscape:connector-curvature="0" /><path
       d="M 361.56,258.24 H 474.12 V 442.8 H 361.56 Z"
       style="fill:#ed7d31;fill-opacity:0.30196001;fill-rule:evenodd;stroke:none"
       id="path4300"
       inkscape:connector-curvature="0" /><path
       d="m 139.56,258.24 h 78 V 442.8 h -78 z"
       style="fill:#5b9bd5;fill-opacity:0.30196001;fill-rule:evenodd;stroke:none"
       id="path4302"
       inkscape:connector-curvature="0" /><path
       d="M 597.12,258.24 H 641.4 V 442.8 h -44.28 z"
       style="fill:#5b9bd5;fill-opacity:0.30196001;fill-rule:evenodd;stroke:none"
       id="path4304"
       inkscape:connector-curvature="0" /><path
       d="M 217.56,258.24 H 361.8 V 442.8 H 217.56 Z"
       style="fill:#a5a5a5;fill-opacity:0.30196001;fill-rule:evenodd;stroke:none"
       id="path4306"
       inkscape:connector-curvature="0" /><path
       d="m 169.32,438.9 c 0,5.27 4.24,9.54 9.48,9.54 5.24,0 9.48,-4.27 9.48,-9.54 0,-5.27 -4.24,-9.54 -9.48,-9.54 -5.24,0 -9.48,4.27 -9.48,9.54 z"
       style="fill:#5b9bd5;fill-opacity:1;fill-rule:evenodd;stroke:none"
       id="path4308"
       inkscape:connector-curvature="0" /><path
       d="m 169.32,438.9 c 0,5.27 4.24,9.54 9.48,9.54 5.24,0 9.48,-4.27 9.48,-9.54 0,-5.27 -4.24,-9.54 -9.48,-9.54 -5.24,0 -9.48,4.27 -9.48,9.54 z"
       style="fill:none;stroke:#41719c;stroke-width:0.95999998;stroke-linecap:butt;stroke-linejoin:miter;stroke-miterlimit:8;stroke-dasharray:none;stroke-opacity:1"
       id="path4310"
       inkscape:connector-curvature="0" /><g
       id="g4312"><g
         id="g4314"
         clip-path="url(#clipPath4318)"><text
           transform="matrix(1,0,0,-1,175.9,435.12)"
           style="font-variant:normal;font-weight:normal;font-size:11.03999996px;font-family:Calibri;-inkscape-font-specification:Calibri;writing-mode:lr-tb;fill:#ffffff;fill-opacity:1;fill-rule:nonzero;stroke:none"
           id="text4322"><tspan
             x="0"
             y="0"
             id="tspan4320">1</tspan></text>
</g></g><path
       d="m 279.84,439.26 c 0,5.27 4.22,9.54 9.42,9.54 5.2,0 9.42,-4.27 9.42,-9.54 0,-5.27 -4.22,-9.54 -9.42,-9.54 -5.2,0 -9.42,4.27 -9.42,9.54 z"
       style="fill:#a5a5a5;fill-opacity:1;fill-rule:evenodd;stroke:none"
       id="path4324"
       inkscape:connector-curvature="0" /><path
       d="m 279.84,439.26 c 0,5.27 4.22,9.54 9.42,9.54 5.2,0 9.42,-4.27 9.42,-9.54 0,-5.27 -4.22,-9.54 -9.42,-9.54 -5.2,0 -9.42,4.27 -9.42,9.54 z"
       style="fill:none;stroke:#787878;stroke-width:0.95999998;stroke-linecap:butt;stroke-linejoin:miter;stroke-miterlimit:8;stroke-dasharray:none;stroke-opacity:1"
       id="path4326"
       inkscape:connector-curvature="0" /><g
       id="g4328"><g
         id="g4330"
         clip-path="url(#clipPath4334)"><text
           transform="matrix(1,0,0,-1,286.39,435.53)"
           style="font-variant:normal;font-weight:normal;font-size:11.03999996px;font-family:Calibri;-inkscape-font-specification:Calibri;writing-mode:lr-tb;fill:#ffffff;fill-opacity:1;fill-rule:nonzero;stroke:none"
           id="text4338"><tspan
             x="0"
             y="0"
             id="tspan4336">2</tspan></text>
</g></g><path
       d="m 409.8,439.62 c 0,5.27 4.24,9.54 9.48,9.54 5.24,0 9.48,-4.27 9.48,-9.54 0,-5.27 -4.24,-9.54 -9.48,-9.54 -5.24,0 -9.48,4.27 -9.48,9.54 z"
       style="fill:#ed7d31;fill-opacity:1;fill-rule:evenodd;stroke:none"
       id="path4340"
       inkscape:connector-curvature="0" /><path
       d="m 409.8,439.62 c 0,5.27 4.24,9.54 9.48,9.54 5.24,0 9.48,-4.27 9.48,-9.54 0,-5.27 -4.24,-9.54 -9.48,-9.54 -5.24,0 -9.48,4.27 -9.48,9.54 z"
       style="fill:none;stroke:#ae5a21;stroke-width:0.95999998;stroke-linecap:butt;stroke-linejoin:miter;stroke-miterlimit:8;stroke-dasharray:none;stroke-opacity:1"
       id="path4342"
       inkscape:connector-curvature="0" /><g
       id="g4344"><g
         id="g4346"
         clip-path="url(#clipPath4350)"><text
           transform="matrix(1,0,0,-1,416.45,435.91)"
           style="font-variant:normal;font-weight:normal;font-size:11.03999996px;font-family:Calibri;-inkscape-font-specification:Calibri;writing-mode:lr-tb;fill:#ffffff;fill-opacity:1;fill-rule:nonzero;stroke:none"
           id="text4354"><tspan
             x="0"
             y="0"
             id="tspan4352">3</tspan></text>
</g></g><path
       d="m 531.36,440.04 c 0,5.24 4.24,9.48 9.48,9.48 5.24,0 9.48,-4.24 9.48,-9.48 0,-5.24 -4.24,-9.48 -9.48,-9.48 -5.24,0 -9.48,4.24 -9.48,9.48 z"
       style="fill:#a5a5a5;fill-opacity:1;fill-rule:evenodd;stroke:none"
       id="path4356"
       inkscape:connector-curvature="0" /><path
       d="m 531.36,440.04 c 0,5.24 4.24,9.48 9.48,9.48 5.24,0 9.48,-4.24 9.48,-9.48 0,-5.24 -4.24,-9.48 -9.48,-9.48 -5.24,0 -9.48,4.24 -9.48,9.48 z"
       style="fill:none;stroke:#787878;stroke-width:0.95999998;stroke-linecap:butt;stroke-linejoin:miter;stroke-miterlimit:8;stroke-dasharray:none;stroke-opacity:1"
       id="path4358"
       inkscape:connector-curvature="0" /><g
       id="g4360"><g
         id="g4362"
         clip-path="url(#clipPath4366)"><text
           transform="matrix(1,0,0,-1,538.03,436.3)"
           style="font-variant:normal;font-weight:normal;font-size:11.03999996px;font-family:Calibri;-inkscape-font-specification:Calibri;writing-mode:lr-tb;fill:#ffffff;fill-opacity:1;fill-rule:nonzero;stroke:none"
           id="text4370"><tspan
             x="0"
             y="0"
             id="tspan4368">4</tspan></text>
</g></g><path
       d="m 610.2,441.78 c 0,5.27 4.22,9.54 9.42,9.54 5.2,0 9.42,-4.27 9.42,-9.54 0,-5.27 -4.22,-9.54 -9.42,-9.54 -5.2,0 -9.42,4.27 -9.42,9.54 z"
       style="fill:#5b9bd5;fill-opacity:1;fill-rule:evenodd;stroke:none"
       id="path4372"
       inkscape:connector-curvature="0" /><path
       d="m 610.2,441.78 c 0,5.27 4.22,9.54 9.42,9.54 5.2,0 9.42,-4.27 9.42,-9.54 0,-5.27 -4.22,-9.54 -9.42,-9.54 -5.2,0 -9.42,4.27 -9.42,9.54 z"
       style="fill:none;stroke:#41719c;stroke-width:0.95999998;stroke-linecap:butt;stroke-linejoin:miter;stroke-miterlimit:8;stroke-dasharray:none;stroke-opacity:1"
       id="path4374"
       inkscape:connector-curvature="0" /><g
       id="g4376"><g
         id="g4378"
         clip-path="url(#clipPath4382)"><text
           transform="matrix(1,0,0,-1,616.8,438)"
           style="font-variant:normal;font-weight:normal;font-size:11.03999996px;font-family:Calibri;-inkscape-font-specification:Calibri;writing-mode:lr-tb;fill:#ffffff;fill-opacity:1;fill-rule:nonzero;stroke:none"
           id="text4386"><tspan
             x="0"
             y="0"
             id="tspan4384">5</tspan></text>
</g></g><g
       id="g4388"
       transform="translate(0,-1.1675676)"><g
         id="g4390"
         clip-path="url(#clipPath4394)"><text
           transform="matrix(1,0,0,-1,160.7,417.58)"
           style="font-variant:normal;font-weight:normal;font-size:18px;font-family:Calibri;-inkscape-font-specification:Calibri;writing-mode:lr-tb;fill:#000000;fill-opacity:1;fill-rule:nonzero;stroke:none"
           id="text4398"><tspan
             x="0 11.07 17.280001 21.365999 29.412001"
             y="0"
             sodipodi:role="line"
             id="tspan4396">Drive</tspan></text>
</g></g><g
       id="g4400"><g
         id="g4402"
         clip-path="url(#clipPath4406)"><text
           transform="matrix(1,0,0,-1,274.22,418.82)"
           style="font-variant:normal;font-weight:normal;font-size:18px;font-family:Calibri;-inkscape-font-specification:Calibri;writing-mode:lr-tb;fill:#000000;fill-opacity:1;fill-rule:nonzero;stroke:none"
           id="text4410"><tspan
             x="0 8.2620001 14.166 23.652"
             y="0"
             sodipodi:role="line"
             id="tspan4408">Stop</tspan></text>
</g></g><g
       id="g4412"><g
         id="g4414"
         clip-path="url(#clipPath4418)"><text
           transform="matrix(1,0,0,-1,406.01,417.58)"
           style="font-variant:normal;font-weight:normal;font-size:18px;font-family:Calibri;-inkscape-font-specification:Calibri;writing-mode:lr-tb;fill:#000000;fill-opacity:1;fill-rule:nonzero;stroke:none"
           id="text4422"><tspan
             x="0 9.1260004 17.406"
             y="0"
             sodipodi:role="line"
             id="tspan4420">PTO</tspan></text>
</g></g><g
       id="g4424"><g
         id="g4426"
         clip-path="url(#clipPath4430)"><text
           transform="matrix(1,0,0,-1,524.83,418.82)"
           style="font-variant:normal;font-weight:normal;font-size:18px;font-family:Calibri;-inkscape-font-specification:Calibri;writing-mode:lr-tb;fill:#000000;fill-opacity:1;fill-rule:nonzero;stroke:none"
           id="text4434"><tspan
             x="0 8.2620001 14.166 23.652"
             y="0"
             sodipodi:role="line"
             id="tspan4432">Stop</tspan></text>
</g></g><g
       id="g4436"><g
         id="g4438"
         clip-path="url(#clipPath4442)"><text
           transform="matrix(1,0,0,-1,601.75,418.44)"
           style="font-variant:normal;font-weight:normal;font-size:18px;font-family:Calibri;-inkscape-font-specification:Calibri;writing-mode:lr-tb;fill:#000000;fill-opacity:1;fill-rule:nonzero;stroke:none"
           id="text4446"><tspan
             x="0 11.07 17.280001 21.365999 29.412001"
             y="0"
             sodipodi:role="line"
             id="tspan4444">Drive</tspan></text>
</g></g></g></svg>