﻿# Resultfile Programm Air Drag - RC 1.2.0.0 Comp 5/31/2022
# Datafile HS: ,I:\martindippold\Git\VECTO-AirDrag\DemoData\DemoData_HS.csdat
# Datafile LS1: ,I:\martindippold\Git\VECTO-AirDrag\DemoData\DemoData_LS1.csdat
# Datafile LS2: ,I:\martindippold\Git\VECTO-AirDrag\DemoData\DemoData_LS2.csdat
#
# Results
# fv_veh:,0.968501080129236
# fv_pe:,1.12031450849315
# beta_ame:,-0.0156820291773556
#
SecID [-],DirID [-],RunID [-],HeadID [-],delta t [s],length [m],delta s [m],v (s) [km/h],v (GPS) [km/h],v_veh_CAN [km/h],v_veh [km/h],vair_ic [m/s],vair_uf [m/s],beta_ic [°],beta_uf [°],valid [-],used [-],val_User [-],val_vVeh_avg [-],val_vVeh_f [-],val_vVeh_1s [-],val_vWind [-],val_vWind_1s [-],val_tq_f [-],val_tq_1s [-],val_beta [-],val_n_eng [-],val_dist [-],val_t_amb [-],val_t_ground [-],vair [m/s],v_wind_avg [m/s],v_wind_1s [m/s],v_wind_1s_max [m/s],beta_avg [°],beta_abs [°],v_air_sq [m2/s2],n_eng [rpm],n_eng_1s_max [rpm],n_eng_1s_min [rpm],n_eng_float_max [rpm],n_eng_float_min [rpm],r_dyn [m],tq_sum [Nm],tq_sum_1s [Nm],tq_sum_1s_max [Nm],tq_sum_1s_min [Nm],tq_sum_float [Nm],tq_sum_float_max [Nm],tq_sum_float_min [Nm],tq_grd [Nm],t_float [s],F_trac [N],F_acc [N],F_grd [N],F_res [N],F_res_ref [N],v_veh_1s [km/h],v_veh_1s_max [km/h],v_veh_1s_min [km/h],v_veh_acc [km/h],a_veh_avg [m/s2],v_veh_float [km/h],v_veh_float_max [km/h],v_veh_float_min [km/h],t_ground [°C],t_amb_veh [°C],t_amb_stat [°C],p_amb_stat [mbar],rh_stat [%],vp_H2O [Pa],rho_air [kg/m3],CdxA(ß)_singleDS [m2],t_tire ,Satelites ,<n_card1> 
1,1,0,1,10.6600000000035,250.64,250.808927336026,84.6439024389967,84.9084086223055,87.4556608809746,84.70090202664,19.9798477037957,22.3837132600459,178.46611059044,178.481792619619,1,1,1,1,1,1,1,1,1,1,1,1,1,1,1,22.5979351978732,2.05185054557751,2.04564417431918,3.30942048682393,-1.21384015131847,1.21384015131847,513.494385894072,1838.3045923149,1841.79207920792,1831.94554455446,1841.44285714286,1831.78571428571,0.439989127968393,1349.00092694555,1351.30830741952,1470.55358828416,1321.61788335842,1351.42898649415,1472.20470371429,1321.71244054095,0,1.06256434203866,3065.97819484065,182.283878221731,0,2883.69431661891,2883.69431661891,84.7001505387502,84.8239938250518,84.4952250100232,84.7001505387502,0.00707898556200896,84.7001986352624,84.8239633480899,84.4933542513276,25,20,24.7999999999995,1015.19999999998,39.2380181818182,1230.87592958189,1.20089851527849,0,40,10,1838.3045923149
2,1,0,1,10.6399999999994,250.64,250.513423505501,84.8030075188016,84.9678948356806,87.5169316807511,84.760242862404,20.1402358893803,22.5633984713472,179.0239342723,179.039616301479,1,1,1,1,1,1,1,1,1,1,1,1,1,1,1,22.7463882646429,1.73609339629273,1.74451471018684,2.37929288930234,-0.767493680672047,0.767493680672047,519.092865639779,1839.37981220657,1843.52475247525,1835.71782178218,1843.02380952381,1835.8,0.440040002821542,1352.44840535127,1350.45792687074,1375.80901933168,1254.8249605604,1350.35964531779,1375.71446189143,1254.83698013905,0,1.06181925022205,3073.45673279063,9.61853849435285,0,3063.83819429627,3063.83819429627,84.7578638814242,84.784733572108,84.7265987673717,84.7578638814242,0.000373535475508848,84.7577894229895,84.7853246746645,84.7284829773189,25,20,24.7999999999995,1015.19999999998,39.644676056338,1243.63257256529,1.20084112918971,0,40,10,1839.37981220657
2,2,0,2,10.6399999999994,250.64,250.772865682463,84.8030075188016,85.0558347417835,87.6075097840374,84.847967853273,20.0731883150798,22.4882841010991,179.394629107981,179.41031113716,1,1,1,1,1,1,1,1,1,1,1,1,1,1,1,22.6904340592777,1.98315326934213,1.98516107778223,2.40293378909576,-0.470726119397519,0.470726119397519,517.335990322291,1841.35539906103,1843.91584158416,1838.48514851485,1843.89523809524,1838.67619047619,0.440022827815969,1348.81152002479,1347.23719415558,1375.65005664257,1262.77263557327,1347.18191589777,1375.55549919429,1264.60881825143,0,1.06072117228326,3065.32897536501,-60.9251495158398,0,3126.25412488085,3126.25412488085,84.8489135678137,84.9047168558215,84.8124577306018,84.8489135678137,-0.00236602522391611,84.8489532237236,84.905629941836,84.8124677014597,25,20,24.9000000000004,1015.19999999998,38.4366625352113,1212.95670692505,1.20097912536562,0,40,10,1841.35539906103
1,2,0,2,10.6399999999994,250.64,250.658964171345,84.8030075188016,85.0172384976526,87.5677556525823,84.8094659340187,20.256353886338,22.6934871480361,179.510018779343,179.525700808521,1,1,1,1,1,1,1,1,1,1,1,1,1,1,1,22.8543219777092,1.73236897348722,1.72779654894727,2.38970364799537,-0.379592526354108,0.379592526354108,524.204893845249,1841.16572769953,1847.30198019802,1833.53465346535,1846.91428571429,1833.47142857143,0.439868465548113,1344.03033723728,1342.70474018618,1375.63534062772,1283.94248985148,1342.6532757818,1375.54078409048,1284.40928853333,0,1.0612029384648,3055.52611643465,-10.2387683901202,0,3065.76488482478,3065.76488482478,84.8088029276129,84.8620392324328,84.7469350845569,84.8088029276129,-0.000397622073402724,84.8087844379382,84.8609394279945,84.7481015808654,25,20,24.9000000000004,1015.19999999998,39.0868033802817,1233.47338674218,1.2008868305502,0,40,10,1841.16572769953
1,1,0,1,10.6500000000015,250.64,250.544763393438,84.7233802816786,84.8985131332078,87.4454685272045,84.6910307210045,19.340864290272,21.6678508711889,179.088264540338,179.103946569517,1,1,1,1,1,1,1,1,1,1,1,1,1,1,1,22.0185204061803,1.99566379985452,1.98751823358804,2.37681868313707,-0.713960757984935,0.713960757984935,485.844734946554,1837.28846153846,1842.18811881188,1832.42574257426,1842.10476190476,1832.33333333333,0.440181162303999,1352.71381745535,1354.15420412622,1408.20619322277,1321.29265688416,1354.23273186004,1409.58593826857,1321.38721432952,0,1.06268803985115,3073.09494516963,250.132374181418,0,2822.96257098821,2822.96257098821,84.6905013582445,84.8483598738599,84.4747306641469,84.6905013582445,0.00971387860898709,84.6905054666911,84.8506978519058,84.4725290799117,25,20,24.7999999999995,1015.19999999998,38.0386008442777,1193.25084047925,1.20106777271609,0,40,9.9859287054409,1837.28846153846
2,1,0,1,10.6399999999994,250.64,250.613417421852,84.8030075188016,85.0018920187793,87.5519487793428,84.7941569602128,19.9163517475681,22.3125778190535,178.666516431925,178.682198461104,1,1,1,1,1,1,1,1,1,1,1,1,1,1,1,22.5454949157816,1.87260207103632,1.87338836318583,2.3660819657386,-1.05119165822187,1.05119165822187,510.146256346092,1839.79953051643,1843.12376237624,1837.4801980198,1843.18571428571,1837.68571428571,0.440115643090954,1346.77342470732,1344.48933976986,1375.4763853297,1270.29093505545,1344.40270879228,1375.38182876095,1271.43191401429,0,1.06139474017123,3060.06823039917,-1.1442744076874,0,3061.21250480686,3061.21250480686,84.791773332967,84.8565674890036,84.7123761851732,84.791773332967,-4.44378410752391E-05,84.7916828783227,84.8552296068171,84.7137286473879,25,20,24.7999999999995,1015.19999999998,38.7108023474178,1214.33744699975,1.20097291407064,0,40,9.82629107981221,1839.79953051643
2,2,0,2,10.6399999999994,250.64,250.816046007203,84.8030075188016,85.0704253521128,87.6225381126761,84.8625228057919,21.3778530515681,23.9499189341063,180.269408450704,180.285090479883,1,1,1,1,1,1,1,1,1,1,1,1,1,1,1,23.8730926843026,1.73708011222519,1.71083492904604,2.51867572625425,0.236553344461503,0.236553344461503,572.317330666778,1841.12253521127,1844.39603960396,1838.65346534653,1844.01428571429,1838.99047619048,0.440153973333686,1346.54892884394,1345.54900438833,1375.31742986931,1321.1193274901,1345.50451634365,1375.22287326952,1321.21388462,0,1.06053923277714,3059.27543554299,-53.4492233894574,0,3112.72465893245,3112.72465893245,84.8632829942783,84.9026130988712,84.8038550437305,84.8632829942783,-0.00207569799570708,84.8632970324408,84.9018487291428,84.8038602172888,25,20,24.9000000000004,1015.19999999998,38.500985915493,1214.9865781568,1.20096999393732,0,40,9,1841.12253521127
1,2,0,2,10.6399999999994,250.64,250.61838026351,84.8030075188016,85.0035211267607,87.5536267605634,84.7957820868377,20.236963797615,22.6717641503188,178.858187793427,178.873869822606,1,1,1,1,1,1,1,1,1,1,1,1,1,1,1,22.8359195560564,1.84956906593943,1.84667659412573,2.31194131259866,-0.902520116346298,0.902520116346298,523.835967794321,1840.39906103286,1842.89108910891,1836.86138613861,1842.94761904762,1837.14761904762,0.439980702822878,1352.67390071671,1352.85732602718,1375.31044242277,1321.11200840594,1352.85010094658,1375.21588500286,1321.20656587524,0,1.06137404408773,3074.39655948975,-14.9087346658059,0,3089.30529415556,3089.30529415556,84.7952043732647,84.8182455314132,84.7630540110485,84.7952043732647,-0.000578979987021588,84.7952056764801,84.8193365878347,84.7635969524801,25,20,24.9000000000004,1015.19999999998,38.0744718309859,1201.52695171481,1.20103054241539,0,40,9,1840.39906103286
1,1,0,1,10.6699999999983,250.64,250.763646601366,84.564573570773,84.8134119850188,87.3578143445692,84.6061375504447,20.0235470245318,22.4326702430779,179.467734082397,179.483416111576,1,1,1,1,1,1,1,1,1,1,1,1,1,1,1,22.6327636976708,1.98161134761669,1.97734867027583,2.52516364720284,-0.405693328761024,0.405693328761024,514.842467933894,1835.30805243446,1839.13861386139,1831.4801980198,1838.94285714286,1831.57476635514,0.44021443667306,1352.01195843277,1353.98931993707,1435.40182711881,1320.96773248911,1354.11497324399,1439.10596461869,1321.06228914571,0,1.06375500655787,3071.26359330549,248.241770579636,0,2823.02182272585,2823.02182272585,84.6054985367218,84.7404164010493,84.370550249543,84.6054985367218,0.0096404571098888,84.6056826329228,84.7399406218114,84.368681135661,25,20,25.0999999999996,1015.09999999999,38.6257806179775,1233.5472622799,1.20076766098096,0,40,10,1835.30805243446
2,1,0,1,10.6399999999994,250.64,250.561466916291,84.8030075188016,84.9841661971831,87.5336911830987,84.7764744585298,19.5475821595493,21.899439899305,178.935126760563,178.950808789742,1,1,1,1,1,1,1,1,1,1,1,1,1,1,1,22.2105136760633,1.96483343182259,1.96415221252444,2.35694365521553,-0.83593323319347,0.83593323319347,494.732976894935,1839.15023474178,1841.72277227723,1836.48514851485,1841.58571428571,1836.8380952381,0.440179210369071,1347.94977547089,1346.67752569435,1375.15148018416,1298.2495621802,1346.60433996036,1375.05692275619,1295.55151752571,0,1.06161614829618,3062.28734029424,49.9268482583098,0,3012.36049203593,3012.36049203593,84.776015433407,84.8516685995797,84.738203999374,84.776015433407,0.00193890672847806,84.7759632673341,84.850327331064,84.7389050635613,25,20,25.0999999999996,1015.09999999999,38.6633539906103,1234.74719999519,1.20076226303007,0,40,10,1839.15023474178
2,2,0,2,10.6399999999994,250.64,250.634754038685,84.8030075188016,85.0090187793426,87.5592893427229,84.8012663037754,22.1709260302348,24.8384100984005,178.34358685446,178.359268883639,1,1,1,1,1,1,1,1,1,1,1,1,1,1,1,24.5879428650738,2.45232894480559,2.43325146701954,4.12481316286622,-1.34277847218627,1.34277847218627,609.574250729088,1840.23145539906,1843.25742574257,1837.44059405941,1843.07619047619,1837.57619047619,0.440049234234112,1352.1736262431,1351.93438130933,1374.94192974257,1320.74361484752,1351.90736431353,1374.84737234571,1320.83817192381,0,1.06130531068575,3072.79944012967,-58.241908949657,0,3131.04134907932,3131.04134907932,84.8021283855266,84.8397966941613,84.748979580748,84.8021283855266,-0.0022618217067828,84.8021562496096,84.8373020983947,84.7489946310995,25,20,25.0284536150235,1015.09999999999,38.7176680751173,1231.22087094946,1.2007781263126,0,40,10,1840.23145539906
1,2,0,2,10.6399999999994,250.64,250.662885121073,84.8030075188016,85.0185276995305,87.5690835305163,84.8107519852324,21.5131527386573,24.1014971365469,179.059680751174,179.075362780352,1,1,1,1,1,1,1,1,1,1,1,1,1,1,1,23.9929291105268,2.1964962012612,2.20764093543669,4.31469376292915,-0.756856709871999,0.756856709871999,580.416586780593,1840.36009389671,1844.19801980198,1837.35643564356,1843.90952380952,1837.61428571429,0.440067694921929,1346.52238966432,1346.97986703903,1386.65411786139,1320.72905077525,1346.99024131219,1386.21719096286,1320.82360823048,0,1.06118705545659,3059.81974291518,30.1259259100658,0,3029.69381700511,3029.69381700511,84.8096558559416,84.8866917082435,84.732435952149,84.8096558559416,0.00116993887029381,84.8096135714312,84.8859828366863,84.7294995345002,25,20,25,1015.09999999999,38.7051022535211,1228.73515617186,1.20078930836489,0,40,10,1840.36009389671
1,1,0,1,10.6399999999994,250.64,250.454182527399,84.8030075188016,84.9477154929579,87.4961469577464,84.7401128357236,21.5078877412394,24.0955986835525,181.53055399061,181.546236019789,1,1,1,1,1,1,1,1,1,1,1,1,1,1,1,23.9842067501203,1.48586630647297,1.49727764186417,2.16396201450384,1.26056461462063,1.26056461462063,576.422619153922,1838.30657276995,1841.93069306931,1835.96534653465,1841.57619047619,1835.9619047619,0.440192339049797,1351.00997185991,1351.08395607576,1374.7754818802,1320.57749907723,1351.07820470213,1374.68092539524,1320.67205586762,0,1.06207198661667,3069.14132224236,140.742435328164,0,2928.39888691419,2928.39888691419,84.7401174170719,84.8614466248411,84.624680138409,84.7401174170719,0.0054657256438122,84.7401383982517,84.8625735199121,84.6224380122895,25,20,24.9000000000004,1015.09999999999,39.2664338028169,1239.14203514739,1.20074249275034,0,40,11,1838.30657276995
2,1,0,1,10.6399999999994,250.64,250.74932890018,84.8030075188016,85.0479117370892,87.5993490892019,84.84006421151,18.8578611897183,21.1267354899914,178.955784037559,178.971466066737,1,1,1,1,1,1,1,1,1,1,1,1,1,1,1,21.5888567986208,2.24021261895122,2.23397487186615,2.42408520983347,-0.815438075353115,0.815438075353115,466.365789500534,1840.05962441315,1842.75742574257,1838.34158415842,1842.49523809524,1838.36666666667,0.440291675737477,1343.4577777138,1341.08606852398,1374.76129911089,1255.98792677525,1340.99474509517,1374.66674167524,1254.98622084667,0,1.06082012529716,3051.28912213738,-14.9982865756613,0,3066.28740871305,3066.28740871305,84.8388749899656,84.885644768165,84.8019290690577,84.8388749899656,-0.000582457731093644,84.8388225853304,84.8822586271995,84.8033281873621,25,20,24.9000000000004,1015.09999999999,39.4417014084507,1244.67300489705,1.2007176115397,0,40,11,1840.05962441315
2,2,0,2,10.6399999999994,250.64,250.716201724284,84.8030075188016,85.0366338028169,87.5877328169012,84.8288138392397,23.1853416797183,25.9748746681594,178.031868544601,178.04755057378,1,1,1,1,1,1,1,1,1,1,1,1,1,1,1,25.5083608692384,2.69549988167158,2.69980532487581,4.24331591112766,-1.60945406478691,1.60945406478691,654.137277353639,1840.21314553991,1842.77722772277,1837.66336633663,1842.7619047619,1837.84285714286,0.440196563268526,1343.50448406714,1343.59500435098,1376.75344233168,1320.40398650594,1343.62379629568,1377.06997899619,1320.49854365905,0,1.06096064029208,3052.05961879143,-68.3480078440156,0,3120.40762663545,3120.40762663545,84.8296017754872,84.9006278634394,84.7899386421209,84.8296017754872,-0.00265429156675789,84.8296207423746,84.9001291324155,84.7886593622407,25,20,24.7999999999995,1015,40.0702267605634,1256.98187364926,1.20054340253668,0,40,11,1840.21314553991
1,2,0,2,10.6399999999994,250.64,250.659695712551,84.8030075188016,85.0174666666667,87.5679906666669,84.8096935454135,23.387200104338,26.2010195899224,177.40861971831,177.424301747488,1,1,1,1,1,1,1,1,1,1,1,1,1,1,1,25.6899764235396,2.73109279619416,2.73564343007591,4.3626010730747,-2.11936102376938,2.11936102376938,662.521754117612,1839.56995305164,1841.92079207921,1837.02475247525,1841.64285714286,1837.34761904762,0.440251220481283,1350.69344239747,1351.09417003375,1374.59488371584,1320.39689692574,1351.10323085054,1374.50032707905,1320.49145357619,0,1.06120000614857,3068.01289521427,7.08123437447381,0,3060.93166083979,3060.93166083979,84.8096955671421,84.8450610249333,84.7865311484692,84.8096955671421,0.000274999393183449,84.8097030281065,84.8447410168338,84.7876143034561,25,20,24.7999999999995,1015,40.7620075117371,1278.68267085115,1.20044578093854,0,40,11,1839.56995305164
1,1,0,1,10.6800000000003,250.64,250.740359208103,84.4853932584247,84.726095416277,87.2678782787652,84.5190343735708,21.5394989606454,24.1310131912843,180.905238540692,180.920920569871,1,1,1,1,1,1,1,1,1,1,1,1,1,1,1,24.0013999339245,1.65117838110208,1.6523444388109,2.5793775005957,0.753223306333863,0.753223306333863,578.047078053928,1833.13985032741,1837.12871287129,1825.62871287129,1836.7619047619,1825.39719626168,0.440281370900482,1343.38048294116,1343.49461397707,1374.44336580495,1320.24502755248,1343.48539734785,1374.34880838476,1320.33958468476,0,1.06485254629115,3051.18109738169,309.823593246293,0,2741.3575041354,2741.3575041354,84.5188052116423,84.6898867270719,84.2254897879115,84.5188052116423,0.0120319842037396,84.5189609086574,84.6910603722974,84.2230472661854,25,20,24.7060113189899,1015.02361131899,40.0832452759588,1250.35031720379,1.20060129380446,0,40,9.99719363891487,1833.13985032741
2,1,0,1,10.6400000000067,250.64,250.486298292464,84.8030075187436,84.9586469483568,87.5074063568075,84.751017575876,20.577349034892,23.0531026701171,180.204948356808,180.220630385986,1,1,1,1,1,1,1,1,1,1,1,1,1,1,1,23.1421262669105,1.56807217551433,1.56926994282035,2.19311497966585,0.179276403723772,0.179276403723772,537.235841363202,1838.32300469484,1840.64851485149,1835.64851485149,1840.50952380952,1835.62380952381,0.440245049803135,1346.69081344798,1344.83021637922,1374.43591035049,1226.16670213861,1344.73553020919,1374.34135374476,1228.59884602381,0,1.06193502212871,3058.96370745867,96.0560321809475,0,2962.90767527772,2962.90767527772,84.7485286703612,84.8335841912426,84.6774222140617,84.7485286703612,0.00373033134683291,84.7484313966006,84.831962798059,84.679070697878,25,20,24.7806797183096,1015,41.0165915492958,1285.18513204499,1.20041652944849,0,40,10,1838.32300469484
2,2,0,2,10.6200000000026,250.64,250.431374515363,84.9627118643858,85.1000611476953,87.653062982126,84.8920861748251,23.6080467753151,26.4484373195705,177.454976481656,177.470658510835,1,1,1,1,1,1,1,1,1,1,1,1,1,1,1,25.8943921193396,3.10229312562765,3.10801238373486,4.47704338753889,-2.08460843122459,2.08460843122459,675.209454469138,1841.41721542803,1845.61386138614,1839.10891089109,1845.1619047619,1839.05238095238,0.440236846845139,1351.55762118646,1352.01800135794,1374.27693683762,1320.07895082871,1352.04174682117,1374.18238026286,1320.17350753905,0,1.06017073513255,3070.06003635777,-105.713891017134,0,3175.7739273749,3175.7739273749,84.8930483119953,85.0249470593647,84.7826199383647,84.8930483119953,-0.00410539382590811,84.8930740695286,85.0238165898352,84.7848116458067,25,20,25.154502728128,1015,39.4270645343368,1263.23141443863,1.20051528881561,0,40,11,1841.41721542803
1,2,0,2,10.6399999999994,250.64,250.713655185282,84.8030075188016,85.0358056338028,87.586879802817,84.8279876941778,24.2838588419437,27.2055593828292,177.291802816901,177.30748484608,1,1,1,1,1,1,1,1,1,1,1,1,1,1,1,26.5030019065498,3.33434382088344,3.34085695991092,4.80131506690692,-2.22602550181099,2.22602550181099,704.999258896862,1841.03849765258,1848.64356435644,1838.34158415842,1848.0380952381,1838.52857142857,0.43999493453117,1345.04844396817,1344.66870185224,1374.26273304851,1320.06436045941,1344.64780637783,1374.16817559619,1320.15891768,0,1.0609712550191,3056.97933145264,0.616913158537899,0,3056.3624182941,3056.3624182941,84.8265051736084,84.8806569876023,84.7713900245038,84.8265051736084,2.39577925645809E-05,84.8264439420835,84.8808905502451,84.7745415681147,25,20,25.2000000000005,1015,38.5203211267606,1237.52764068032,1.20063091790744,0,40,11,1841.03849765258
1,1,0,1,10.6299999999974,250.64,250.512653170474,84.8827845719871,85.0474652255638,87.5988891823309,84.8396187912087,22.3956516812688,25.0901735056845,181.222781954887,181.238463984066,1,1,1,1,1,1,1,1,1,1,1,1,1,1,1,24.793888011951,2.05309102114181,2.04995469638306,2.83046293476447,1.01640322679909,1.01640322679909,616.904539816636,1840.46334586466,1843.16831683168,1837.80198019802,1842.67619047619,1837.80952380952,0.440192782898676,1343.71164904352,1345.59070661716,1454.1385899505,1319.91255198614,1345.68640796045,1454.17113002476,1320.0071094381,0,1.06082637926273,3052.55720456262,92.4513121847412,0,2960.10589237788,2960.10589237788,84.8390982452201,84.9204308337921,84.7353792365206,84.8390982452201,0.00359034222076664,84.8390780112071,84.9166885638835,84.7330432338333,25,20,25.7000000000005,1014.90000000001,37.353702537594,1236.23646767871,1.2005178890444,0,40,9,1840.46334586466
2,1,0,1,10.6399999999994,250.64,250.756641540567,84.8030075188016,85.0503718309859,87.6018829859156,84.842518293214,20.7875003651925,23.2885382544318,180.145643192488,180.161325221667,1,1,1,1,1,1,1,1,1,1,1,1,1,1,1,23.3373305863667,1.7600788069651,1.75064329364692,2.30442325683982,0.134817175999463,0.134817175999463,547.087388364487,1839.97276995305,1843.07425742574,1838.29207920792,1842.64285714286,1838.44285714286,0.440325195825831,1350.50325738958,1349.40883989724,1374.10376692178,1271.80408439505,1349.34786401539,1374.00920947429,1271.6537798819,0,1.06078949107294,3067.05923593714,-30.9318931018659,0,3097.991129039,3097.991129039,84.8418302099549,84.8857040289242,84.815934361806,84.8418302099549,-0.00120123856706275,84.8417990090923,84.8845197543879,84.8157833879672,25,20,25.7000000000005,1014.90000000001,37.0280812206573,1225.45989348916,1.20056636774245,0,40,9,1839.97276995305
2,2,0,2,10.6200000000026,250.64,250.473488009236,84.9627118643858,85.114297271872,87.6677261900283,84.9062875075164,19.1944034703763,21.5037686897339,179.12611476952,179.141796798699,1,1,1,1,1,1,1,1,1,1,1,1,1,1,1,21.8974461878168,2.06741757126595,2.07523683364317,2.39037887029016,-0.683201653958108,0.683201653958108,480.242911572013,1841.09031044214,1844.24257425743,1838.65346534653,1844.02857142857,1839.1,0.440388674464023,1348.8017893444,1347.90460940739,1373.94480062772,1319.73937722376,1347.86437697702,1373.85024318667,1319.83393382,0,1.05999245705017,3062.75961935887,-23.2741361295506,0,3086.03375548842,3086.03375548842,84.9071849763134,84.9438783408333,84.8722419598016,84.9071849763134,-0.000903849946778664,84.9072030712464,84.9435845767843,84.8731096125674,25,20,25.7999999999995,1014.90000000001,38.1677479774224,1270.68854835287,1.20036290546739,0,40,11,1841.09031044214
1,2,0,2,10.6399999999994,250.64,250.697303577675,84.8030075188016,85.0302882629109,87.5811969107982,84.8224838071191,20.6385049035681,23.1216164770744,178.293183098592,178.30886512777,1,1,1,1,1,1,1,1,1,1,1,1,1,1,1,23.2008988869941,2.10355748032977,2.10826671221844,2.8966489196505,-1.36781595218599,1.36781595218599,541.97020101216,1839.86431924883,1843.43069306931,1837.46534653465,1843.28095238095,1837.58095238095,0.440247167424181,1349.65312979418,1348.72519958965,1373.93025500594,1312.64236426436,1348.67737321508,1373.8356978781,1312.63467085905,0,1.06104023218074,3065.66389999371,-65.4226454461993,0,3131.08654543991,3131.08654543991,84.8219418633034,84.908983630481,84.7362286407352,84.8219418633034,-0.00254068526004657,84.821930760048,84.9107412293459,84.736928952405,25,20,25.7999999999995,1014.90000000001,38.227303943662,1272.67129788086,1.20035398601729,0,40,11,1839.86431924883
1,1,1,1,59.7300000000032,250.64,250.114083456358,15.106378704168,15.1117229661867,15.5649511004117,15.0746719529076,1.62270907264814,1.81794451715119,179.736936725812,179.752618754996,0,0,1,0,1,1,1,1,1,1,1,1,1,1,1,2.27059836903859,1.92148960598441,1.92060835902539,2.93600241131922,-0.0519733163921205,0.0519733163921205,5.37492527282689,753.572908344445,756.874326044554,749.591951772277,756.130902031993,750.953941387646,0.477566642237363,649.278724655475,649.286524269225,671.169650439604,627.75267889901,649.454956005199,650.820865791062,648.112825540303,0,5.97030807077988,1359.55778114692,5.40787539211931,0,1354.1499057548,1354.1499057548,15.0746475634777,15.130946261492,15.0174862682829,15.0746475634777,0.00021001457833473,15.0742341232222,15.1167886856639,15.0299547880722,20,20,24.5131035152327,1015.31673920317,40.2970909943087,1242.60289413574,1.20098449086979,0,40,9,301.429163337547
2,1,1,1,59.989999999998,250.64,250.671180170191,15.0409068178035,15.0796644999994,15.5320253432597,15.0427833215419,2.31868599999999,2.59765756643997,176.81359,176.829272029186,0,0,1,0,1,1,1,1,1,1,1,1,1,1,1,2.89927943231847,1.29304965589851,1.2939154093822,2.36390095975947,-2.32233797861367,2.32233797861367,8.63949886730627,751.936448020079,755.113469264357,748.397215953466,754.745260956449,750.07722278153,0.477593551247789,649.704865525916,649.69189457265,671.104740350495,627.687603513862,649.410291981087,650.670956770589,648.183343361642,0,5.98296529467362,1360.37355693544,-0.0571059260403559,0,1360.43066286149,1360.43066286149,15.0428531076704,15.0984285047924,14.9856928709933,15.0428531076704,-2.21770586564505E-06,15.042707843625,15.0762510444946,15.0045196052563,20,20,24.3868065333321,1015.29753839991,40.4670620666666,1238.44342428431,1.20098038464831,0,40,9,300.77457920815
2,2,1,2,59.6399999999994,250.64,249.879862857064,15.129175050302,15.1292759430005,15.5738644361205,15.0833045281693,4.91819413243924,5.50992424215758,183.333688181056,183.34937021024,0,0,1,0,1,1,1,1,1,1,1,1,1,1,1,5.2561725029513,1.1023393952216,1.10348233496555,2.00767022553331,2.82270004059689,2.82270004059689,27.9040542154051,756.269404861693,768.925742574257,752.648514851485,768.852445193929,753.432612312812,0.476136372512159,649.605532099682,649.592071442509,670.99647959604,627.579230037624,649.301848922301,650.659245946206,647.945377005227,0,5.96691486629302,1364.33532863311,-14.3045254317668,0,1378.63985406487,1378.63985406487,15.0833075615783,15.1608819914352,15.0297631222223,15.0833075615783,-0.00055551555074823,15.0832516932164,15.1608634462238,15.0415871822707,20,20,24.3550963956394,1015.29999999989,39.6467303101425,1211.03528843933,1.20110660615455,0,40,10,302.507761944676
1,2,1,2,59.989999999998,250.64,250.539717623619,15.0409068178035,15.0717258333329,15.52387470249,15.0348894171524,4.66918683333333,5.23095775224853,179.87928,179.894962029181,0,0,1,0,1,1,1,1,1,1,1,1,1,1,1,5.02817228978135,1.17756036987015,1.17773691232707,2.81795235660481,-0.0412176932475776,0.0412176932475776,26.5004459381028,753.359083333333,755.455445544554,749.955445544554,754.504173622704,751.508319467554,0.476441518231698,648.994356591932,649.003654862295,670.92412670099,627.506956452475,649.205906908427,650.449243801176,647.927354568297,0,5.98611040566087,1362.17382593564,0.420346715850732,0,1361.7534792198,1361.7534792198,15.0348954633961,15.0847573462593,14.9666997976824,15.0348954633961,1.63241443048818E-05,15.0348136808999,15.0622011133577,14.992024340628,20,20,24.3446416666652,1015.29973448323,40.5022934,1236.39422770015,1.20099221277697,0,40,10,301.343633333334
1,1,2,1,60.3300000000017,250.64,251.849054155588,14.9561412232716,15.0650858468675,15.5170384222738,15.0282684723789,3.53794630427578,3.96361257494986,182.093359297315,182.109041326496,0,0,1,0,1,1,1,1,1,1,1,1,1,1,1,4.00299171065168,0.587508057320102,0.587036559558804,1.56405647593922,1.6845767290033,1.6845767290033,16.4217658176337,748.039608882996,749.415841584158,745,748.681742043551,745.542148760331,0.479618295292431,626.028593418445,626.03924354792,647.990498772277,604.573486016832,626.274380469707,627.537708832773,624.914406037943,0,5.98875911867581,1305.27174036173,15.4985604022359,0,1289.7731799595,1289.7731799595,15.0282188068737,15.0698233954147,14.9126243549486,15.0282188068737,0.000601885840863525,15.0280396498288,15.0611188965075,14.9287042313753,23,20,25.5461799801149,1014.90000000007,37.7294894928737,1237.32735137906,1.2005129816759,0,40,10.9593967517401,299.215843553199
2,1,2,1,60,250.64,251.073955827132,15.0384,15.1013411098147,15.5543813431094,15.0644351315436,3.76848341943009,4.22188664980341,180.5563856024,180.572067631582,0,0,1,0,1,1,1,1,1,1,1,1,1,1,1,4.21384313633188,0.773338839802401,0.773259770509879,1.48033981001305,0.479638754849706,0.479638754849706,18.4977983764641,748.758790201633,749.663366336634,747.678217821782,749.034453781513,748.500834724541,0.480310751762939,626.124375095668,626.128102298505,647.925349155445,604.501288424752,626.209435159425,627.577078596458,624.845591192411,0,5.97436766839253,1303.58632179246,-5.2634649592245,0,1308.84978675168,1308.84978675168,15.0643334636101,15.1115528466568,15.0034710987415,15.0643334636101,-0.000204406406183476,15.0630987132481,15.0826292802769,14.9754739021533,23,20,25.6000000000029,1014.91666388945,38.1848612564572,1256.26848545287,1.20044757739972,0,40,10.9455090818197,299.503516080653
2,2,2,2,60.0099999999948,250.64,251.729209717284,15.035894017665,15.1467335888034,15.592397641161,15.1012539572697,2.921661946018,3.27318026703629,178.863625458181,178.879307487364,0,0,1,0,1,1,1,1,1,1,1,1,1,1,1,3.44865777996309,0.877326017438717,0.876796826254788,1.90226402109538,-0.895076728314525,0.895076728314525,12.3938207039832,748.985838053982,750,747.732673267327,749.978077571669,748.371452420701,0.481338716716624,625.6259607962,625.645941903503,647.809828318812,604.392816127723,626.074238470711,627.472714544013,624.767058647893,0,5.95983606473052,1299.77822053346,-17.1275917224016,0,1316.90581225586,1316.90581225586,15.1012507549634,15.2107533177896,15.0306125264369,15.1012507549634,-0.000665149193102969,15.101217667968,15.2107533177896,15.0491432103124,23,20,25.4259330223227,1014.90000000007,38.1648456514495,1242.69623962521,1.2004888295931,0,40,10.9966677774075,299.594335221594
1,2,2,2,60.0299999999988,250.64,250.934128940979,15.0308845577214,15.0853829113924,15.5379443987343,15.048515933162,4.05762275149901,4.54581363849623,178.711593937375,178.727275966558,0,0,1,0,1,1,1,1,1,1,1,1,1,1,1,4.47486597221544,0.854927510130048,0.856617826992462,1.91210089757264,-1.01749729522549,1.01749729522549,20.9003157256174,748.448117921386,749.475247524752,747.292079207921,748.804020100503,747.942404006678,0.480002348782333,626.291132600468,626.280305329817,647.74469879703,604.327707022772,626.046129025505,627.354687257335,624.823413298995,0,5.98067606861555,1304.76821677697,-4.48953609195828,0,1309.25775286893,1309.25775286893,15.048485212124,15.0882337379272,15.0121132927857,15.048485212124,-0.000174350916192555,15.0483493166773,15.0713417579757,15.0257900373999,23,20,25.3999999999971,1014.90000000007,37.952828697535,1233.88934545686,1.20052844763456,0,40,10.6350766155896,299.379247168555
