<?xml version="1.0" encoding="UTF-8" standalone="no"?>
<svg
   xmlns:dc="http://purl.org/dc/elements/1.1/"
   xmlns:cc="http://creativecommons.org/ns#"
   xmlns:rdf="http://www.w3.org/1999/02/22-rdf-syntax-ns#"
   xmlns:svg="http://www.w3.org/2000/svg"
   xmlns="http://www.w3.org/2000/svg"
   xmlns:xlink="http://www.w3.org/1999/xlink"
   xmlns:sodipodi="http://sodipodi.sourceforge.net/DTD/sodipodi-0.dtd"
   xmlns:inkscape="http://www.inkscape.org/namespaces/inkscape"
   width="487.44748pt"
   height="17.259525pt"
   viewBox="0 0 487.44748 17.259525"
   version="1.1"
   id="svg2"
   inkscape:version="0.91 r13725"
   sodipodi:docname="GBX-Editor_Tout.svg">
  <metadata
     id="metadata202">
    <rdf:RDF>
      <cc:Work
         rdf:about="">
        <dc:format>image/svg+xml</dc:format>
        <dc:type
           rdf:resource="http://purl.org/dc/dcmitype/StillImage" />
        <dc:title></dc:title>
      </cc:Work>
    </rdf:RDF>
  </metadata>
  <sodipodi:namedview
     pagecolor="#ffffff"
     bordercolor="#666666"
     borderopacity="1"
     objecttolerance="10"
     gridtolerance="10"
     guidetolerance="10"
     inkscape:pageopacity="0"
     inkscape:pageshadow="2"
     inkscape:window-width="640"
     inkscape:window-height="480"
     id="namedview200"
     showgrid="false"
     fit-margin-top="0"
     fit-margin-left="0"
     fit-margin-right="0"
     fit-margin-bottom="0"
     inkscape:zoom="0.34962963"
     inkscape:cx="346.44495"
     inkscape:cy="1.9757065"
     inkscape:window-x="0"
     inkscape:window-y="0"
     inkscape:window-maximized="0"
     inkscape:current-layer="svg2" />
  <defs
     id="defs4">
    <g
       id="g6">
      <symbol
         overflow="visible"
         id="glyph0-0"
         style="overflow:visible">
        <path
           style="stroke:none"
           d="m 4.984375,-4.28125 0,-0.1875 C 4.984375,-4.601563 4.988281,-4.722656 5,-4.828125 5.019531,-4.941406 5.0625,-5.054688 5.125,-5.171875 5.195313,-5.292969 5.289063,-5.4375 5.40625,-5.59375 5.527344,-5.746094 5.703125,-5.941406 5.921875,-6.171875 6.054688,-6.316406 6.175781,-6.457031 6.28125,-6.59375 6.394531,-6.726563 6.488281,-6.867188 6.5625,-7.015625 6.644531,-7.167969 6.707031,-7.332031 6.75,-7.5 6.800781,-7.664063 6.828125,-7.851563 6.828125,-8.0625 6.828125,-8.496094 6.726563,-8.835938 6.53125,-9.078125 6.34375,-9.316406 6.066406,-9.4375 5.703125,-9.4375 c -0.1875,0 -0.355469,0.035156 -0.5,0.09375 -0.136719,0.054687 -0.257812,0.132812 -0.359375,0.234375 -0.105469,0.105469 -0.195312,0.230469 -0.265625,0.375 -0.074219,0.148437 -0.136719,0.308594 -0.1875,0.484375 l -0.84375,0 0,-1.140625 c 0.339844,-0.175781 0.71875,-0.332031 1.125,-0.46875 0.402344,-0.132813 0.800781,-0.203125 1.1875,-0.203125 0.414063,0 0.765625,0.05078 1.046875,0.140625 0.289063,0.085937 0.523438,0.199219 0.703125,0.34375 0.183594,0.148437 0.320313,0.324219 0.40625,0.53125 0.082031,0.210937 0.125,0.433594 0.125,0.671875 0,0.21875 -0.027344,0.425781 -0.078125,0.609375 -0.042969,0.179687 -0.117187,0.355469 -0.21875,0.53125 C 7.738281,-7.054688 7.597656,-6.863281 7.421875,-6.65625 7.242188,-6.445313 7.027344,-6.210938 6.78125,-5.953125 6.59375,-5.753906 6.441406,-5.589844 6.328125,-5.46875 6.210938,-5.34375 6.121094,-5.222656 6.0625,-5.109375 6.007813,-4.992188 5.972656,-4.871094 5.953125,-4.75 c -0.023437,0.117187 -0.03125,0.257812 -0.03125,0.421875 l 0,0.046875 z m 1.09375,0.96875 0,1.40625 -1.265625,0 0,-1.40625 z m 3.1875,2.5 0,-10.359375 -6.6875,0 0,10.359375 z m 0.90625,-11.171875 0,11.984375 -8.5,0 0,-11.984375 z"
           id="path9"
           inkscape:connector-curvature="0" />
      </symbol>
      <symbol
         overflow="visible"
         id="glyph0-1"
         style="overflow:visible">
        <path
           style="stroke:none"
           d="m 7.453125,-12.140625 c 1.132813,0 2.003906,0.332031 2.609375,0.984375 0.613281,0.65625 0.921875,1.605469 0.921875,2.84375 0,0.917969 -0.160156,1.945312 -0.46875,3.078125 -0.304687,1.125 -0.753906,2.105469 -1.34375,2.9375 -0.59375,0.824219 -1.273437,1.441406 -2.03125,1.84375 -0.75,0.40625 -1.539062,0.609375 -2.359375,0.609375 -1.179687,0 -2.074219,-0.328125 -2.6875,-0.984375 -0.605469,-0.652344 -0.90625,-1.59375 -0.90625,-2.8125 0,-0.882813 0.144531,-1.878906 0.4375,-2.984375 0.300781,-1.101563 0.726563,-2.078125 1.28125,-2.921875 0.558594,-0.851563 1.226563,-1.5 2,-1.9375 0.777344,-0.433594 1.628906,-0.65625 2.546875,-0.65625 z m 1.859375,3.46875 c 0,-1.789063 -0.652344,-2.6875 -1.953125,-2.6875 -0.636719,0 -1.230469,0.226562 -1.78125,0.671875 -0.542969,0.449219 -1.023437,1.097656 -1.4375,1.9375 -0.40625,0.835937 -0.726562,1.757812 -0.953125,2.765625 -0.230469,1 -0.34375,1.882812 -0.34375,2.640625 0,1.8125 0.65625,2.71875 1.96875,2.71875 0.800781,0 1.535156,-0.367188 2.203125,-1.109375 C 7.691406,-2.472656 8.242188,-3.507813 8.671875,-4.84375 9.097656,-6.175781 9.3125,-7.453125 9.3125,-8.671875 Z"
           id="path12"
           inkscape:connector-curvature="0" />
      </symbol>
      <symbol
         overflow="visible"
         id="glyph0-2"
         style="overflow:visible">
        <path
           style="stroke:none"
           d="m 7.921875,-2.84375 c -0.125,0.5625 -0.1875,1.003906 -0.1875,1.3125 0,0.230469 0.035156,0.398437 0.109375,0.5 0.082031,0.105469 0.203125,0.15625 0.359375,0.15625 0.175781,0 0.363281,-0.066406 0.5625,-0.203125 C 8.972656,-1.222656 9.253906,-1.5 9.609375,-1.90625 l 0.5,0.484375 C 9.578125,-0.847656 9.121094,-0.441406 8.75,-0.203125 8.375,0.0234375 7.976563,0.140625 7.5625,0.140625 c -0.367187,0 -0.660156,-0.1210937 -0.875,-0.359375 -0.21875,-0.238281 -0.328125,-0.554688 -0.328125,-0.953125 0,-0.320313 0.070313,-0.671875 0.21875,-1.046875 L 6.46875,-2.25 C 5.882813,-1.4375 5.332031,-0.835938 4.8125,-0.453125 4.300781,-0.0664063 3.769531,0.125 3.21875,0.125 c -0.542969,0 -0.960937,-0.15625 -1.25,-0.46875 -0.292969,-0.308594 -0.4375,-0.742188 -0.4375,-1.296875 0,-0.371094 0.082031,-0.898438 0.25,-1.578125 L 2.359375,-5.515625 C 2.511719,-6.160156 2.59375,-6.613281 2.59375,-6.875 c 0,-0.226563 -0.042969,-0.394531 -0.125,-0.5 C 2.394531,-7.488281 2.277344,-7.546875 2.125,-7.546875 c -0.1875,0 -0.386719,0.082031 -0.59375,0.234375 -0.199219,0.148437 -0.472656,0.417969 -0.8125,0.8125 l -0.5,-0.5 c 0.488281,-0.496094 0.859375,-0.84375 1.109375,-1.03125 0.257813,-0.183594 0.503906,-0.316406 0.734375,-0.390625 0.226563,-0.082031 0.488281,-0.125 0.78125,-0.125 0.371094,0 0.664063,0.128906 0.875,0.375 0.214844,0.25 0.328125,0.589844 0.328125,1.015625 0,0.46875 -0.089844,1.050781 -0.265625,1.734375 L 3.390625,-3.90625 C 3.296875,-3.519531 3.222656,-3.214844 3.171875,-3 c -0.042969,0.21875 -0.074219,0.410156 -0.09375,0.5625 -0.023437,0.15625 -0.03125,0.289062 -0.03125,0.390625 0,0.40625 0.066406,0.707031 0.203125,0.890625 0.132813,0.179687 0.351563,0.265625 0.65625,0.265625 0.246094,0 0.515625,-0.097656 0.796875,-0.296875 0.289063,-0.195313 0.59375,-0.492188 0.90625,-0.890625 C 5.929688,-2.472656 6.1875,-2.851563 6.375,-3.21875 6.570313,-3.589844 6.734375,-4.054688 6.859375,-4.609375 L 7.6875,-8.40625 l 1.53125,0 z"
           id="path15"
           inkscape:connector-curvature="0" />
      </symbol>
      <symbol
         overflow="visible"
         id="glyph0-3"
         style="overflow:visible">
        <path
           style="stroke:none"
           d="M 6.109375,-1.65625 C 5.597656,-1.039063 5.101563,-0.585938 4.625,-0.296875 c -0.46875,0.29296875 -0.960937,0.4375 -1.46875,0.4375 -1.230469,0 -1.84375,-0.617188 -1.84375,-1.859375 0,-0.382813 0.050781,-0.796875 0.15625,-1.234375 l 1.03125,-4.5625 -1.46875,0 0.125,-0.609375 c 0.339844,0 0.601563,-0.019531 0.78125,-0.0625 0.183594,-0.050781 0.335938,-0.117188 0.453125,-0.203125 0.121094,-0.082031 0.234375,-0.195313 0.328125,-0.34375 0.101563,-0.152344 0.203125,-0.351563 0.296875,-0.59375 0.089844,-0.238281 0.234375,-0.65625 0.421875,-1.25 l 1.21875,0 -0.484375,2.171875 2.671875,0 -0.203125,0.890625 -2.671875,0 -0.78125,3.40625 c -0.148437,0.667969 -0.242187,1.148437 -0.28125,1.4375 -0.042969,0.292969 -0.0625,0.523437 -0.0625,0.6875 0,0.730469 0.300781,1.09375 0.90625,1.09375 0.246094,0 0.519531,-0.097656 0.8125,-0.296875 0.289063,-0.195313 0.632813,-0.53125 1.03125,-1 z"
           id="path18"
           inkscape:connector-curvature="0" />
      </symbol>
      <symbol
         overflow="visible"
         id="glyph0-4"
         style="overflow:visible">
        <path
           style="stroke:none"
           d="m 2.40625,-5.546875 c 0.121094,-0.539063 0.1875,-0.984375 0.1875,-1.328125 0,-0.226563 -0.042969,-0.394531 -0.125,-0.5 C 2.394531,-7.488281 2.277344,-7.546875 2.125,-7.546875 c -0.1875,0 -0.386719,0.082031 -0.59375,0.234375 -0.199219,0.148437 -0.472656,0.417969 -0.8125,0.8125 l -0.5,-0.5 c 0.519531,-0.550781 0.960938,-0.945313 1.328125,-1.1875 0.363281,-0.238281 0.769531,-0.359375 1.21875,-0.359375 0.363281,0 0.648438,0.121094 0.859375,0.359375 0.214844,0.242187 0.328125,0.558594 0.328125,0.953125 0,0.335937 -0.070312,0.679687 -0.203125,1.03125 l 0.109375,0.046875 c 1.082031,-1.589844 2.160156,-2.390625 3.234375,-2.390625 0.632813,0 1.128906,0.246094 1.484375,0.734375 0.351563,0.492187 0.53125,1.179687 0.53125,2.0625 0,0.960937 -0.195312,1.910156 -0.578125,2.84375 -0.386719,0.9375 -0.929687,1.683594 -1.625,2.234375 -0.6875,0.542969 -1.460937,0.8125 -2.3125,0.8125 -0.78125,0 -1.433594,-0.171875 -1.953125,-0.515625 l -0.40625,1.9375 c -0.085937,0.414063 -0.125,0.753906 -0.125,1.015625 0,0.257813 0.0625,0.441406 0.1875,0.546875 0.132813,0.113281 0.394531,0.1875 0.78125,0.21875 L 3,3.78125 l -2.703125,0 z M 3.296875,-3.0625 c -0.0625,0.3125 -0.101562,0.554687 -0.109375,0.71875 -0.011719,0.167969 -0.015625,0.332031 -0.015625,0.484375 0,0.460937 0.09375,0.792969 0.28125,1 0.195313,0.210937 0.535156,0.3125 1.015625,0.3125 0.300781,0 0.578125,-0.054688 0.828125,-0.171875 0.246094,-0.121094 0.488281,-0.296875 0.71875,-0.515625 0.226563,-0.226563 0.429688,-0.5 0.609375,-0.8125 0.183594,-0.308594 0.347656,-0.675781 0.484375,-1.09375 C 7.253906,-3.566406 7.363281,-4 7.4375,-4.4375 c 0.070313,-0.445313 0.109375,-0.863281 0.109375,-1.25 0,-0.613281 -0.089844,-1.070313 -0.265625,-1.375 -0.167969,-0.300781 -0.441406,-0.453125 -0.8125,-0.453125 -0.304687,0 -0.601562,0.105469 -0.890625,0.3125 -0.28125,0.199219 -0.601562,0.523437 -0.953125,0.96875 -0.34375,0.4375 -0.617187,0.878906 -0.8125,1.3125 -0.1875,0.4375 -0.339844,0.941406 -0.453125,1.5 z"
           id="path21"
           inkscape:connector-curvature="0" />
      </symbol>
      <symbol
         overflow="visible"
         id="glyph0-5"
         style="overflow:visible">
        <path
           style="stroke:none"
           d="M 5.234375,0 1.53125,0 1.640625,-0.4375 c 0.226563,-0.027344 0.398438,-0.070313 0.515625,-0.125 0.113281,-0.058594 0.210938,-0.15625 0.296875,-0.28125 0.082031,-0.121094 0.164063,-0.316406 0.25,-0.578125 C 2.785156,-1.679688 2.882813,-2.082031 3,-2.625 l 1.890625,-8.59375 -1.125,0 c -0.367187,0 -0.660156,0.05469 -0.875,0.15625 -0.210937,0.105469 -0.425781,0.304687 -0.640625,0.59375 -0.21875,0.28125 -0.488281,0.761719 -0.796875,1.4375 l -0.84375,0 L 1.28125,-12 l 9.171875,0 -0.6875,3.09375 -0.84375,0 c 0,-0.558594 -0.019531,-0.984375 -0.046875,-1.265625 -0.03125,-0.289063 -0.089844,-0.507813 -0.171875,-0.65625 -0.074219,-0.152344 -0.175781,-0.257813 -0.296875,-0.3125 -0.117187,-0.05078 -0.332031,-0.07813 -0.640625,-0.07813 l -1.296875,0 -1.90625,8.65625 C 4.507813,-2.332036 4.472656,-2.148443 4.453125,-2.01563 4.429688,-1.878911 4.410156,-1.730474 4.390625,-1.57813 4.378906,-1.429688 4.375,-1.300781 4.375,-1.1875 c 0,0.179687 0.023438,0.320312 0.078125,0.421875 0.058594,0.105469 0.148438,0.183594 0.265625,0.234375 0.121094,0.042969 0.328125,0.074219 0.609375,0.09375 z"
           id="path24"
           inkscape:connector-curvature="0" />
      </symbol>
      <symbol
         overflow="visible"
         id="glyph0-6"
         style="overflow:visible">
        <path
           style="stroke:none"
           d="m 3.828125,0.15625 c -0.90625,0 -1.613281,-0.2539063 -2.109375,-0.765625 -0.5,-0.507813 -0.75,-1.242188 -0.75,-2.203125 0,-0.464844 0.066406,-1.007813 0.203125,-1.625 0.183594,-0.832031 0.492188,-1.554688 0.921875,-2.171875 0.425781,-0.621094 0.953125,-1.101563 1.578125,-1.4375 0.621094,-0.332031 1.3125,-0.5 2.0625,-0.5 0.933594,0 1.648438,0.261719 2.140625,0.78125 0.496094,0.511719 0.75,1.242187 0.75,2.1875 0,0.6875 -0.121094,1.417969 -0.359375,2.1875 C 8.023438,-2.617188 7.695313,-1.964844 7.28125,-1.4375 6.875,-0.914063 6.382813,-0.519531 5.8125,-0.25 5.238281,0.0195313 4.574219,0.15625 3.828125,0.15625 Z M 2.5,-2.4375 c 0,0.648437 0.132813,1.128906 0.40625,1.4375 0.269531,0.304687 0.671875,0.453125 1.203125,0.453125 0.570313,0 1.082031,-0.253906 1.53125,-0.765625 C 6.085938,-1.832031 6.4375,-2.554688 6.6875,-3.484375 6.945313,-4.410156 7.078125,-5.226563 7.078125,-5.9375 c 0,-0.621094 -0.128906,-1.097656 -0.375,-1.421875 C 6.460938,-7.679688 6.082031,-7.84375 5.5625,-7.84375 c -0.605469,0 -1.136719,0.257812 -1.59375,0.765625 -0.460937,0.511719 -0.820312,1.242187 -1.078125,2.1875 C 2.628906,-3.941406 2.5,-3.121094 2.5,-2.4375 Z"
           id="path27"
           inkscape:connector-curvature="0" />
      </symbol>
      <symbol
         overflow="visible"
         id="glyph0-7"
         style="overflow:visible">
        <path
           style="stroke:none"
           d="M 3.90625,-6.28125 C 4.476563,-7.058594 5.03125,-7.632813 5.5625,-8 c 0.527344,-0.363281 1.066406,-0.546875 1.609375,-0.546875 0.425781,0 0.785156,0.035156 1.078125,0.09375 l -0.421875,1.96875 -0.90625,0 C 6.878906,-6.722656 6.824219,-6.910156 6.765625,-7.046875 6.703125,-7.179688 6.621094,-7.273438 6.53125,-7.328125 6.445313,-7.378906 6.335938,-7.40625 6.203125,-7.40625 c -0.210937,0 -0.441406,0.097656 -0.6875,0.28125 -0.25,0.179687 -0.535156,0.460937 -0.84375,0.84375 -0.3125,0.386719 -0.566406,0.761719 -0.75,1.125 C 3.742188,-4.800781 3.589844,-4.351563 3.46875,-3.8125 L 2.640625,0 1.109375,0 2.390625,-5.578125 c 0.082031,-0.339844 0.132813,-0.613281 0.15625,-0.8125 C 2.566406,-6.585938 2.578125,-6.75 2.578125,-6.875 c 0,-0.226563 -0.039062,-0.394531 -0.109375,-0.5 -0.074219,-0.113281 -0.195312,-0.171875 -0.359375,-0.171875 -0.179687,0 -0.371094,0.082031 -0.578125,0.234375 C 1.332031,-7.164063 1.054688,-6.894531 0.703125,-6.5 l -0.5,-0.5 c 0.539063,-0.558594 0.988281,-0.957031 1.34375,-1.1875 0.363281,-0.238281 0.769531,-0.359375 1.21875,-0.359375 0.363281,0 0.648438,0.121094 0.859375,0.359375 0.214844,0.242187 0.328125,0.558594 0.328125,0.953125 0,0.292969 -0.058594,0.597656 -0.171875,0.90625 z"
           id="path30"
           inkscape:connector-curvature="0" />
      </symbol>
      <symbol
         overflow="visible"
         id="glyph0-8"
         style="overflow:visible">
        <path
           style="stroke:none"
           d="m 6.03125,-2.046875 c -0.5,0.71875 -1.019531,1.261719 -1.546875,1.625 C 3.960938,-0.0546875 3.449219,0.125 2.953125,0.125 c -0.648437,0 -1.148437,-0.238281 -1.5,-0.71875 -0.355469,-0.488281 -0.53125,-1.171875 -0.53125,-2.046875 0,-1.007813 0.195313,-1.976563 0.59375,-2.90625 0.394531,-0.925781 0.9375,-1.65625 1.625,-2.1875 0.695313,-0.539063 1.46875,-0.8125 2.3125,-0.8125 0.363281,0 0.707031,0.042969 1.03125,0.125 0.332031,0.085937 0.675781,0.238281 1.03125,0.453125 l 0.8125,-0.578125 0.5625,0.140625 -2.25,9.984375 c -0.105469,0.445313 -0.15625,0.78125 -0.15625,1 0,0.257813 0.0625,0.441406 0.1875,0.546875 0.132813,0.113281 0.398438,0.1875 0.796875,0.21875 l -0.078125,0.4375 -2.75,0 1.515625,-5.765625 z m 0.703125,-3.3125 c 0.089844,-0.414063 0.140625,-0.8125 0.140625,-1.1875 0,-0.457031 -0.101562,-0.789063 -0.296875,-1 -0.1875,-0.207031 -0.511719,-0.3125 -0.96875,-0.3125 -0.59375,0 -1.132812,0.246094 -1.609375,0.734375 -0.46875,0.480469 -0.839844,1.132812 -1.109375,1.953125 -0.273437,0.8125 -0.40625,1.632812 -0.40625,2.453125 0,0.605469 0.082031,1.058594 0.25,1.359375 0.164063,0.304687 0.441406,0.453125 0.828125,0.453125 0.183594,0 0.375,-0.035156 0.5625,-0.109375 0.183594,-0.082031 0.378906,-0.210938 0.578125,-0.390625 0.207031,-0.175781 0.40625,-0.390625 0.59375,-0.640625 0.195313,-0.246094 0.378906,-0.5 0.546875,-0.75 0.164063,-0.257813 0.316406,-0.5625 0.453125,-0.90625 C 6.441406,-4.054688 6.5625,-4.476563 6.65625,-4.96875 Z"
           id="path33"
           inkscape:connector-curvature="0" />
      </symbol>
      <symbol
         overflow="visible"
         id="glyph0-9"
         style="overflow:visible">
        <path
           style="stroke:none"
           d="M 7.359375,-1.75 C 6.785156,-1.125 6.207031,-0.648438 5.625,-0.328125 5.039063,-0.015625 4.363281,0.140625 3.59375,0.140625 2.75,0.140625 2.089844,-0.117188 1.625,-0.640625 1.15625,-1.160156 0.921875,-1.878906 0.921875,-2.796875 0.921875,-3.429688 1.03125,-4.101563 1.25,-4.8125 1.476563,-5.527344 1.820313,-6.175781 2.28125,-6.75 2.738281,-7.320313 3.285156,-7.765625 3.921875,-8.078125 4.566406,-8.386719 5.25,-8.546875 5.96875,-8.546875 c 0.707031,0 1.238281,0.148437 1.59375,0.4375 0.351563,0.28125 0.53125,0.726562 0.53125,1.328125 0,1 -0.472656,1.753906 -1.40625,2.25 -0.929687,0.5 -2.316406,0.75 -4.15625,0.75 -0.074219,0.34375 -0.109375,0.726562 -0.109375,1.140625 0,0.617187 0.117188,1.066406 0.359375,1.34375 0.238281,0.273437 0.632813,0.40625 1.1875,0.40625 0.527344,0 1.015625,-0.113281 1.453125,-0.34375 0.433594,-0.238281 0.898438,-0.601563 1.390625,-1.09375 z M 2.6875,-4.53125 c 0.820313,-0.00781 1.53125,-0.082031 2.125,-0.21875 0.589844,-0.144531 1.046875,-0.375 1.359375,-0.6875 0.308594,-0.320313 0.46875,-0.75 0.46875,-1.28125 0,-0.351563 -0.085937,-0.628906 -0.25,-0.828125 -0.167969,-0.207031 -0.414062,-0.3125 -0.734375,-0.3125 -0.59375,0 -1.167969,0.304687 -1.71875,0.90625 -0.542969,0.59375 -0.960937,1.402344 -1.25,2.421875 z"
           id="path36"
           inkscape:connector-curvature="0" />
      </symbol>
      <symbol
         overflow="visible"
         id="glyph0-10"
         style="overflow:visible">
        <path
           style="stroke:none"
           d="m 1.3125,-6.375 0,-1.171875 10.828125,0 0,1.171875 z m 0,3.640625 0,-1.171875 10.828125,0 0,1.171875 z M 12.5,-5.140625 Z"
           id="path39"
           inkscape:connector-curvature="0" />
      </symbol>
      <symbol
         overflow="visible"
         id="glyph0-11"
         style="overflow:visible">
        <path
           style="stroke:none"
           d="M 3.4375,-2.5625 C 3.363281,-2.21875 3.308594,-1.941406 3.28125,-1.734375 3.257813,-1.535156 3.25,-1.351563 3.25,-1.1875 c 0,0.261719 0.0625,0.449219 0.1875,0.5625 0.132813,0.105469 0.359375,0.167969 0.671875,0.1875 L 4.015625,0 0.5,0 0.59375,-0.4375 c 0.226563,-0.027344 0.394531,-0.082031 0.5,-0.15625 C 1.207031,-0.675781 1.300781,-0.785156 1.375,-0.921875 1.457031,-1.066406 1.53125,-1.238281 1.59375,-1.4375 1.652344,-1.644531 1.75,-2.039063 1.875,-2.625 l 1.5,-6.765625 c 0.121094,-0.582031 0.1875,-1.050781 0.1875,-1.40625 0,-0.277344 -0.070312,-0.472656 -0.203125,-0.578125 -0.136719,-0.113281 -0.355469,-0.175781 -0.65625,-0.1875 L 2.796875,-12 6.3125,-12 6.21875,-11.5625 C 6,-11.51953 5.835938,-11.46484 5.734375,-11.40625 c -0.09375,0.05469 -0.179687,0.144531 -0.25,0.265625 -0.074219,0.117187 -0.152344,0.300781 -0.234375,0.546875 -0.085937,0.25 -0.191406,0.660156 -0.3125,1.21875 z"
           id="path42"
           inkscape:connector-curvature="0" />
      </symbol>
      <symbol
         overflow="visible"
         id="glyph0-12"
         style="overflow:visible">
        <path
           style="stroke:none"
           d="m 2.40625,-5.578125 c 0.121094,-0.558594 0.1875,-0.992188 0.1875,-1.296875 0,-0.226563 -0.042969,-0.394531 -0.125,-0.5 C 2.394531,-7.488281 2.277344,-7.546875 2.125,-7.546875 c -0.1875,0 -0.386719,0.082031 -0.59375,0.234375 -0.199219,0.148437 -0.472656,0.417969 -0.8125,0.8125 l -0.5,-0.5 c 0.527344,-0.558594 0.972656,-0.957031 1.328125,-1.1875 0.363281,-0.238281 0.769531,-0.359375 1.21875,-0.359375 0.371094,0 0.664063,0.121094 0.875,0.359375 0.214844,0.242187 0.328125,0.558594 0.328125,0.953125 0,0.3125 -0.074219,0.660156 -0.21875,1.03125 L 3.859375,-6.15625 C 4.429688,-6.964844 4.976563,-7.566406 5.5,-7.953125 c 0.519531,-0.394531 1.054688,-0.59375 1.609375,-0.59375 0.539063,0 0.957031,0.160156 1.25,0.46875 0.289063,0.3125 0.4375,0.753906 0.4375,1.3125 0,0.367187 -0.085937,0.894531 -0.25,1.578125 L 7.96875,-2.890625 c -0.15625,0.636719 -0.234375,1.089844 -0.234375,1.359375 0,0.230469 0.035156,0.398437 0.109375,0.5 0.082031,0.105469 0.203125,0.15625 0.359375,0.15625 0.175781,0 0.363281,-0.066406 0.5625,-0.203125 C 8.972656,-1.222656 9.253906,-1.5 9.609375,-1.90625 l 0.5,0.484375 c -0.5,0.542969 -0.941406,0.941406 -1.3125,1.1875 -0.375,0.2460938 -0.804687,0.375 -1.28125,0.375 -0.386719,0 -0.695312,-0.13671875 -0.921875,-0.40625 C 6.375,-0.535156 6.265625,-0.882813 6.265625,-1.3125 c 0,-0.371094 0.09375,-0.929688 0.28125,-1.671875 L 6.9375,-4.515625 C 7.070313,-5.054688 7.160156,-5.457031 7.203125,-5.71875 7.253906,-5.988281 7.28125,-6.207031 7.28125,-6.375 c 0,-0.402344 -0.070312,-0.695313 -0.203125,-0.875 -0.136719,-0.175781 -0.355469,-0.265625 -0.65625,-0.265625 -0.25,0 -0.523437,0.101562 -0.8125,0.296875 -0.28125,0.199219 -0.585937,0.496094 -0.90625,0.890625 -0.3125,0.398437 -0.570312,0.785156 -0.765625,1.15625 C 3.75,-4.804688 3.589844,-4.351563 3.46875,-3.8125 L 2.640625,0 1.109375,0 Z"
           id="path45"
           inkscape:connector-curvature="0" />
      </symbol>
      <symbol
         overflow="visible"
         id="glyph0-13"
         style="overflow:visible">
        <path
           style="stroke:none"
           d="m 1.3125,-4.5625 0,-1.171875 10.828125,0 0,1.171875 z"
           id="path48"
           inkscape:connector-curvature="0" />
      </symbol>
      <symbol
         overflow="visible"
         id="glyph0-14"
         style="overflow:visible">
        <path
           style="stroke:none"
           d="m 0.59375,-0.4375 c 0.226563,-0.027344 0.394531,-0.082031 0.5,-0.15625 C 1.207031,-0.675781 1.300781,-0.785156 1.375,-0.921875 1.457031,-1.066406 1.53125,-1.238281 1.59375,-1.4375 1.652344,-1.644531 1.75,-2.039063 1.875,-2.625 l 1.5,-6.765625 c 0.121094,-0.582031 0.1875,-1.050781 0.1875,-1.40625 0,-0.277344 -0.070312,-0.472656 -0.203125,-0.578125 -0.136719,-0.113281 -0.355469,-0.175781 -0.65625,-0.1875 L 2.796875,-12 6.3125,-12 6.21875,-11.5625 C 6,-11.51953 5.835938,-11.46484 5.734375,-11.40625 c -0.09375,0.05469 -0.179687,0.144531 -0.25,0.265625 -0.074219,0.117187 -0.152344,0.300781 -0.234375,0.546875 -0.085937,0.25 -0.191406,0.660156 -0.3125,1.21875 l -1.875,8.5625 2.15625,0 c 0.394531,0 0.703125,-0.035156 0.921875,-0.109375 C 6.367188,-0.992188 6.582031,-1.128906 6.78125,-1.328125 6.988281,-1.535156 7.1875,-1.8125 7.375,-2.15625 7.570313,-2.507813 7.769531,-2.941406 7.96875,-3.453125 l 0.859375,0 L 7.9375,0 0.5,0 Z"
           id="path51"
           inkscape:connector-curvature="0" />
      </symbol>
      <symbol
         overflow="visible"
         id="glyph0-15"
         style="overflow:visible">
        <path
           style="stroke:none"
           d="m 6.625,-6.265625 c -0.0625,-0.519531 -0.238281,-0.914063 -0.515625,-1.1875 -0.273437,-0.269531 -0.710937,-0.40625 -1.3125,-0.40625 -0.460937,0 -0.835937,0.121094 -1.125,0.359375 C 3.390625,-7.257813 3.25,-6.945313 3.25,-6.5625 c 0,0.210937 0.035156,0.398437 0.109375,0.5625 0.070313,0.15625 0.21875,0.335937 0.4375,0.53125 0.214844,0.1875 0.5625,0.425781 1.03125,0.703125 0.371094,0.21875 0.671875,0.425781 0.890625,0.609375 0.226563,0.1875 0.40625,0.378906 0.53125,0.5625 0.121094,0.179687 0.21875,0.371094 0.28125,0.578125 0.058594,0.199219 0.09375,0.441406 0.09375,0.71875 0,0.523437 -0.144531,0.972656 -0.421875,1.34375 -0.28125,0.375 -0.664062,0.660156 -1.140625,0.84375 C 4.582031,0.0664063 4.039063,0.15625 3.4375,0.15625 2.945313,0.15625 2.464844,0.113281 2,0.03125 1.53125,-0.0390625 1.007813,-0.160156 0.4375,-0.328125 L 0.859375,-2.25 l 0.6875,0 c 0.019531,0.5625 0.175781,0.992187 0.46875,1.28125 0.300781,0.28125 0.769531,0.421875 1.40625,0.421875 0.550781,0 0.984375,-0.125 1.296875,-0.375 0.308594,-0.246094 0.46875,-0.601563 0.46875,-1.0625 0,-0.257813 -0.042969,-0.484375 -0.125,-0.671875 C 4.976563,-2.839844 4.832031,-3.023438 4.625,-3.203125 4.425781,-3.378906 4.113281,-3.601563 3.6875,-3.875 3.226563,-4.144531 2.867188,-4.390625 2.609375,-4.609375 2.359375,-4.835938 2.164063,-5.082031 2.03125,-5.34375 c -0.125,-0.257813 -0.1875,-0.554688 -0.1875,-0.890625 0,-0.464844 0.125,-0.875 0.375,-1.21875 0.246094,-0.351563 0.601563,-0.625 1.0625,-0.8125 0.464844,-0.183594 1.007813,-0.28125 1.625,-0.28125 0.539063,0 1.035156,0.039062 1.484375,0.109375 0.445313,0.0625 0.894531,0.175781 1.34375,0.328125 l -0.390625,1.84375 z"
           id="path54"
           inkscape:connector-curvature="0" />
      </symbol>
      <symbol
         overflow="visible"
         id="glyph0-16"
         style="overflow:visible">
        <path
           style="stroke:none"
           d="m 7.328125,-5.140625 3.953125,4 -0.890625,0.875 L 6.453125,-4.28125 2.40625,-0.296875 1.578125,-1.125 5.59375,-5.140625 l -4,-3.9375 0.890625,-0.875 3.96875,3.96875 3.984375,-3.96875 0.828125,0.8125 z"
           id="path57"
           inkscape:connector-curvature="0" />
      </symbol>
      <symbol
         overflow="visible"
         id="glyph0-17"
         style="overflow:visible">
        <path
           style="stroke:none"
           d="M 7.265625,-2.8125 C 7.398438,-3.363281 7.46875,-3.835938 7.46875,-4.234375 7.46875,-4.503906 7.394531,-4.691406 7.25,-4.796875 7.113281,-4.910156 6.894531,-4.976563 6.59375,-5 l 0.109375,-0.421875 3.515625,0 L 10.109375,-5 C 9.890625,-4.945313 9.726563,-4.886719 9.625,-4.828125 9.53125,-4.773438 9.441406,-4.683594 9.359375,-4.5625 9.285156,-4.445313 9.207031,-4.261719 9.125,-4.015625 c -0.074219,0.25 -0.175781,0.660156 -0.296875,1.21875 l -0.59375,2.75 L 7.53125,0.15625 7.078125,-0.546875 c -0.617187,0.292969 -1.101562,0.4804687 -1.453125,0.5625 -0.34375,0.0820313 -0.699219,0.125 -1.0625,0.125 -1.105469,0 -1.945312,-0.316406 -2.515625,-0.953125 C 1.472656,-1.445313 1.1875,-2.375 1.1875,-3.59375 c 0,-0.863281 0.144531,-1.835938 0.4375,-2.921875 0.289063,-1.089844 0.71875,-2.066406 1.28125,-2.921875 0.558594,-0.851563 1.238281,-1.515625 2.03125,-1.984375 0.789063,-0.476563 1.664063,-0.71875 2.625,-0.71875 0.558594,0 1.070313,0.03906 1.53125,0.109375 0.464844,0.0625 0.976563,0.183594 1.53125,0.359375 l -0.546875,2.359375 -0.84375,0 C 9.179688,-10.039063 9.019531,-10.5625 8.75,-10.875 c -0.273437,-0.320313 -0.710937,-0.484375 -1.3125,-0.484375 -0.492187,0 -0.949219,0.128906 -1.375,0.375 -0.429687,0.25 -0.835937,0.628906 -1.21875,1.125 -0.386719,0.5 -0.738281,1.132812 -1.046875,1.890625 -0.304687,0.761719 -0.542969,1.558594 -0.71875,2.390625 -0.167969,0.824219 -0.25,1.601562 -0.25,2.328125 0,0.917969 0.15625,1.585937 0.46875,2 0.308594,0.417969 0.800781,0.625 1.46875,0.625 0.246094,0 0.5,-0.023438 0.75,-0.078125 C 5.761719,-0.761719 6,-0.863281 6.21875,-1 c 0.214844,-0.132813 0.410156,-0.3125 0.578125,-0.53125 0.175781,-0.226563 0.300781,-0.519531 0.375,-0.875 z"
           id="path60"
           inkscape:connector-curvature="0" />
      </symbol>
      <symbol
         overflow="visible"
         id="glyph0-18"
         style="overflow:visible">
        <path
           style="stroke:none"
           d="m 7.546875,-7.96875 0.8125,-0.578125 0.5625,0.140625 -1.296875,5.5625 c -0.125,0.5625 -0.1875,1.003906 -0.1875,1.3125 0,0.230469 0.035156,0.398437 0.109375,0.5 C 7.628906,-0.925781 7.75,-0.875 7.90625,-0.875 c 0.175781,0 0.363281,-0.066406 0.5625,-0.203125 C 8.664063,-1.222656 8.945313,-1.5 9.3125,-1.90625 l 0.5,0.484375 c -0.523437,0.5625 -0.972656,0.964844 -1.34375,1.203125 -0.375,0.2382813 -0.777344,0.359375 -1.203125,0.359375 -0.367187,0 -0.660156,-0.1210937 -0.875,-0.359375 C 6.171875,-0.457031 6.0625,-0.773438 6.0625,-1.171875 c 0,-0.320313 0.066406,-0.664063 0.203125,-1.03125 L 6.15625,-2.234375 c -0.5625,0.8125 -1.101562,1.414062 -1.609375,1.796875 -0.5,0.375 -1.035156,0.5625 -1.59375,0.5625 -0.648437,0 -1.148437,-0.238281 -1.5,-0.71875 -0.355469,-0.488281 -0.53125,-1.171875 -0.53125,-2.046875 0,-1.007813 0.195313,-1.976563 0.59375,-2.90625 0.394531,-0.925781 0.9375,-1.65625 1.625,-2.1875 0.695313,-0.539063 1.46875,-0.8125 2.3125,-0.8125 0.382813,0 0.738281,0.042969 1.0625,0.125 0.332031,0.085937 0.675781,0.238281 1.03125,0.453125 z M 6.78125,-5.359375 C 6.832031,-5.597656 6.863281,-5.800781 6.875,-5.96875 c 0.019531,-0.175781 0.03125,-0.367188 0.03125,-0.578125 0,-0.445313 -0.101562,-0.773438 -0.296875,-0.984375 -0.1875,-0.214844 -0.511719,-0.328125 -0.96875,-0.328125 -0.605469,0 -1.152344,0.246094 -1.640625,0.734375 -0.480469,0.480469 -0.855469,1.132812 -1.125,1.953125 -0.261719,0.8125 -0.390625,1.632812 -0.390625,2.453125 0,0.605469 0.082031,1.058594 0.25,1.359375 0.164063,0.304687 0.441406,0.453125 0.828125,0.453125 0.394531,0 0.773438,-0.164063 1.140625,-0.5 0.371094,-0.332031 0.757813,-0.804688 1.15625,-1.421875 0.394531,-0.621094 0.675781,-1.335938 0.84375,-2.140625 z"
           id="path63"
           inkscape:connector-curvature="0" />
      </symbol>
      <symbol
         overflow="visible"
         id="glyph0-19"
         style="overflow:visible">
        <path
           style="stroke:none"
           d="m 7.25,-5.4375 c 0.277344,0.210937 0.503906,0.460937 0.671875,0.75 0.175781,0.292969 0.316406,0.699219 0.421875,1.21875 l 0.203125,1.03125 c 0.058594,0.324219 0.132813,0.617187 0.21875,0.875 0.082031,0.25 0.179688,0.457031 0.296875,0.609375 0.113281,0.148437 0.238281,0.261719 0.375,0.34375 0.144531,0.074219 0.359375,0.132812 0.640625,0.171875 L 9.984375,0 7.546875,0 c -0.1875,-0.519531 -0.355469,-1.140625 -0.5,-1.859375 l -0.390625,-1.875 C 6.59375,-4.042969 6.511719,-4.3125 6.421875,-4.53125 6.335938,-4.757813 6.230469,-4.929688 6.109375,-5.046875 5.984375,-5.167969 5.835938,-5.25 5.671875,-5.28125 c -0.167969,-0.039063 -0.378906,-0.0625 -0.625,-0.0625 l -1,0 L 3.4375,-2.5625 c -0.054687,0.230469 -0.089844,0.414062 -0.109375,0.546875 -0.023437,0.136719 -0.042969,0.285156 -0.0625,0.4375 C 3.253906,-1.429688 3.25,-1.300781 3.25,-1.1875 c 0,0.179687 0.023438,0.320312 0.078125,0.421875 0.058594,0.105469 0.148438,0.183594 0.265625,0.234375 0.121094,0.042969 0.328125,0.074219 0.609375,0.09375 L 4.109375,0 0.5,0 0.59375,-0.4375 c 0.226563,-0.027344 0.394531,-0.082031 0.5,-0.15625 C 1.207031,-0.675781 1.300781,-0.785156 1.375,-0.921875 1.457031,-1.066406 1.53125,-1.238281 1.59375,-1.4375 1.652344,-1.644531 1.75,-2.039063 1.875,-2.625 l 1.5,-6.765625 c 0.121094,-0.582031 0.1875,-1.046875 0.1875,-1.390625 0,-0.277344 -0.070312,-0.476563 -0.203125,-0.59375 -0.125,-0.113281 -0.347656,-0.175781 -0.65625,-0.1875 L 2.796875,-12 6.71875,-12 c 0.613281,0 1.117188,0.03906 1.515625,0.109375 0.394531,0.07422 0.726563,0.183594 1,0.328125 0.277344,0.148437 0.515625,0.339844 0.703125,0.578125 0.183594,0.230469 0.328125,0.492187 0.421875,0.78125 0.08984,0.28125 0.140625,0.589844 0.140625,0.921875 0,0.90625 -0.277344,1.679687 -0.828125,2.3125 -0.554687,0.625 -1.363281,1.105469 -2.421875,1.4375 z m -2,-0.65625 c 0.851563,0 1.523438,-0.113281 2.015625,-0.34375 C 7.753906,-6.664063 8.144531,-7.039063 8.4375,-7.5625 8.726563,-8.082031 8.875,-8.644531 8.875,-9.25 8.875,-9.507813 8.847656,-9.734375 8.796875,-9.921875 8.753906,-10.117188 8.691406,-10.28125 8.609375,-10.40625 8.535156,-10.539063 8.433594,-10.65625 8.3125,-10.75 8.195313,-10.851563 8.050781,-10.941406 7.875,-11.015625 c -0.167969,-0.07031 -0.371094,-0.125 -0.609375,-0.15625 -0.230469,-0.02734 -0.542969,-0.04687 -0.9375,-0.04687 -0.3125,0 -0.644531,0.01172 -0.984375,0.03125 l -1.125,5.09375 z"
           id="path66"
           inkscape:connector-curvature="0" />
      </symbol>
      <symbol
         overflow="visible"
         id="glyph0-20"
         style="overflow:visible">
        <path
           style="stroke:none"
           d="m 4.96875,-11.84375 -0.40625,1.703125 -1.5625,0 0.40625,-1.703125 z M 2.140625,-5.921875 C 2.273438,-6.503906 2.34375,-6.945313 2.34375,-7.25 2.34375,-7.507813 2.273438,-7.6875 2.140625,-7.78125 2.015625,-7.871094 1.769531,-7.925781 1.40625,-7.9375 L 1.5,-8.40625 l 2.140625,-0.078125 0.53125,0 -1.265625,5.640625 c -0.136719,0.574219 -0.203125,1.011719 -0.203125,1.3125 0,0.230469 0.035156,0.398437 0.109375,0.5 0.082031,0.105469 0.207031,0.15625 0.375,0.15625 0.175781,0 0.363281,-0.066406 0.5625,-0.203125 C 3.945313,-1.222656 4.226563,-1.5 4.59375,-1.90625 l 0.5,0.484375 C 4.519531,-0.816406 4.050781,-0.402344 3.6875,-0.1875 3.332031,0.0273438 2.929688,0.140625 2.484375,0.140625 c -0.375,0 -0.679687,-0.13671875 -0.90625,-0.40625 -0.230469,-0.277344 -0.34375,-0.640625 -0.34375,-1.078125 0,-0.445313 0.082031,-1.015625 0.25,-1.703125 z"
           id="path69"
           inkscape:connector-curvature="0" />
      </symbol>
    </g>
  </defs>
  <g
     id="g74"
     style="fill:#000000;fill-opacity:1"
     transform="translate(-73.691498,-265.76172)">
    <use
       height="100%"
       width="100%"
       id="use76"
       y="279.23999"
       x="72.503998"
       xlink:href="#glyph0-1" />
    <use
       height="100%"
       width="100%"
       id="use78"
       y="279.23999"
       x="84.671997"
       xlink:href="#glyph0-2" />
  </g>
  <g
     id="g80"
     style="fill:#000000;fill-opacity:1"
     transform="translate(-73.691498,-265.76172)">
    <use
       height="100%"
       width="100%"
       id="use82"
       y="279.23999"
       x="94.949997"
       xlink:href="#glyph0-3" />
    <use
       height="100%"
       width="100%"
       id="use84"
       y="279.23999"
       x="102.06"
       xlink:href="#glyph0-4" />
    <use
       height="100%"
       width="100%"
       id="use86"
       y="279.23999"
       x="112.104"
       xlink:href="#glyph0-2" />
    <use
       height="100%"
       width="100%"
       id="use88"
       y="279.23999"
       x="122.436"
       xlink:href="#glyph0-3" />
  </g>
  <g
     id="g90"
     style="fill:#000000;fill-opacity:1"
     transform="translate(-73.691498,-265.76172)">
    <use
       height="100%"
       width="100%"
       id="use92"
       y="279.23999"
       x="134.06"
       xlink:href="#glyph0-5" />
    <use
       height="100%"
       width="100%"
       id="use94"
       y="279.23999"
       x="144.77"
       xlink:href="#glyph0-6" />
    <use
       height="100%"
       width="100%"
       id="use96"
       y="279.23999"
       x="154.364"
       xlink:href="#glyph0-7" />
  </g>
  <g
     id="g98"
     style="fill:#000000;fill-opacity:1"
     transform="translate(-73.691498,-265.76172)">
    <use
       height="100%"
       width="100%"
       id="use100"
       y="279.23999"
       x="162.86"
       xlink:href="#glyph0-8" />
    <use
       height="100%"
       width="100%"
       id="use102"
       y="279.23999"
       x="172.562"
       xlink:href="#glyph0-2" />
    <use
       height="100%"
       width="100%"
       id="use104"
       y="279.23999"
       x="182.894"
       xlink:href="#glyph0-9" />
  </g>
  <g
     id="g106"
     style="fill:#000000;fill-opacity:1"
     transform="translate(-73.691498,-265.76172)">
    <use
       height="100%"
       width="100%"
       id="use108"
       y="279.23999"
       x="197.3"
       xlink:href="#glyph0-10" />
  </g>
  <path
     inkscape:connector-curvature="0"
     id="path110"
     d="m 377.60928,1e-5 c 1.71094,0.44922 3.01953,1.42969 3.9375,2.91797 0.91016,1.5 1.37109,3.30859 1.37109,5.42187 0,2.11719 -0.44921,3.92969 -1.37109,5.41797 -0.91016,1.49219 -2.22656,2.46094 -3.9375,2.91016 l -0.22266,-0.66797 c 1.36329,-0.46094 2.36329,-1.35156 3.02344,-2.6836 0.66016,-1.32812 0.98828,-3.01953 0.98828,-5.0664 0,-1.98047 -0.32812,-3.6211 -0.98047,-4.9336 -0.66015,-1.30859 -1.66796,-2.1875 -3.05078,-2.63671 z m -228.64062,0 0.23828,0.67969 c -1.36719,0.44921 -2.38672,1.32812 -3.03907,2.63671 -0.66015,1.3125 -0.98828,2.95312 -0.98828,4.9336 0,2.04687 0.32813,3.73827 0.98828,5.0664 0.65235,1.33204 1.66016,2.22266 3.01172,2.6836 l -0.21093,0.66797 c -1.71094,-0.44922 -3.03125,-1.41797 -3.94141,-2.91016 -0.91797,-1.48828 -1.36719,-3.30078 -1.36719,-5.41798 0,-2.11327 0.44922,-3.92187 1.36719,-5.42187 C 145.94912,1.4297 147.25772,0.44922 148.96866,0 Z"
     style="fill:#000000;fill-opacity:1;fill-rule:evenodd;stroke:none" />
  <g
     id="g112"
     style="fill:#000000;fill-opacity:1"
     transform="translate(-73.691498,-265.76172)">
    <use
       height="100%"
       width="100%"
       id="use114"
       y="279.23999"
       x="223.25"
       xlink:href="#glyph0-11" />
    <use
       height="100%"
       width="100%"
       id="use116"
       y="279.23999"
       x="230.07201"
       xlink:href="#glyph0-12" />
    <use
       height="100%"
       width="100%"
       id="use118"
       y="279.23999"
       x="240.40401"
       xlink:href="#glyph0-4" />
    <use
       height="100%"
       width="100%"
       id="use120"
       y="279.23999"
       x="250.448"
       xlink:href="#glyph0-2" />
    <use
       height="100%"
       width="100%"
       id="use122"
       y="279.23999"
       x="260.78"
       xlink:href="#glyph0-3" />
  </g>
  <g
     id="g124"
     style="fill:#000000;fill-opacity:1"
     transform="translate(-73.691498,-265.76172)">
    <use
       height="100%"
       width="100%"
       id="use126"
       y="279.23999"
       x="272.57001"
       xlink:href="#glyph0-5" />
    <use
       height="100%"
       width="100%"
       id="use128"
       y="279.23999"
       x="283.28"
       xlink:href="#glyph0-6" />
    <use
       height="100%"
       width="100%"
       id="use130"
       y="279.23999"
       x="292.87399"
       xlink:href="#glyph0-7" />
  </g>
  <g
     id="g132"
     style="fill:#000000;fill-opacity:1"
     transform="translate(-73.691498,-265.76172)">
    <use
       height="100%"
       width="100%"
       id="use134"
       y="279.23999"
       x="301.37"
       xlink:href="#glyph0-8" />
    <use
       height="100%"
       width="100%"
       id="use136"
       y="279.23999"
       x="311.07199"
       xlink:href="#glyph0-2" />
    <use
       height="100%"
       width="100%"
       id="use138"
       y="279.23999"
       x="321.40399"
       xlink:href="#glyph0-9" />
  </g>
  <g
     id="g140"
     style="fill:#000000;fill-opacity:1"
     transform="translate(-73.691498,-265.76172)">
    <use
       height="100%"
       width="100%"
       id="use142"
       y="279.23999"
       x="334.85001"
       xlink:href="#glyph0-13" />
  </g>
  <g
     id="g144"
     style="fill:#000000;fill-opacity:1"
     transform="translate(-73.691498,-265.76172)">
    <use
       height="100%"
       width="100%"
       id="use146"
       y="279.23999"
       x="352.25"
       xlink:href="#glyph0-5" />
    <use
       height="100%"
       width="100%"
       id="use148"
       y="279.23999"
       x="362.95999"
       xlink:href="#glyph0-6" />
    <use
       height="100%"
       width="100%"
       id="use150"
       y="279.23999"
       x="372.55399"
       xlink:href="#glyph0-7" />
  </g>
  <g
     id="g152"
     style="fill:#000000;fill-opacity:1"
     transform="translate(-73.691498,-265.76172)">
    <use
       height="100%"
       width="100%"
       id="use154"
       y="279.23999"
       x="381.04999"
       xlink:href="#glyph0-8" />
    <use
       height="100%"
       width="100%"
       id="use156"
       y="279.23999"
       x="390.75201"
       xlink:href="#glyph0-2" />
  </g>
  <g
     id="g158"
     style="fill:#000000;fill-opacity:1"
     transform="translate(-73.691498,-265.76172)">
    <use
       height="100%"
       width="100%"
       id="use160"
       y="279.23999"
       x="401.23001"
       xlink:href="#glyph0-9" />
  </g>
  <g
     id="g162"
     style="fill:#000000;fill-opacity:1"
     transform="translate(-73.691498,-265.76172)">
    <use
       height="100%"
       width="100%"
       id="use164"
       y="279.23999"
       x="414.54999"
       xlink:href="#glyph0-14" />
    <use
       height="100%"
       width="100%"
       id="use166"
       y="279.23999"
       x="424.12601"
       xlink:href="#glyph0-6" />
    <use
       height="100%"
       width="100%"
       id="use168"
       y="279.23999"
       x="433.72"
       xlink:href="#glyph0-15" />
    <use
       height="100%"
       width="100%"
       id="use170"
       y="279.23999"
       x="442.03601"
       xlink:href="#glyph0-15" />
  </g>
  <g
     id="g172"
     style="fill:#000000;fill-opacity:1"
     transform="translate(-73.691498,-265.76172)">
    <use
       height="100%"
       width="100%"
       id="use174"
       y="279.23999"
       x="462.42999"
       xlink:href="#glyph0-16" />
  </g>
  <g
     id="g176"
     style="fill:#000000;fill-opacity:1"
     transform="translate(-73.691498,-265.76172)">
    <use
       height="100%"
       width="100%"
       id="use178"
       y="279.23999"
       x="479.35001"
       xlink:href="#glyph0-17" />
  </g>
  <g
     id="g180"
     style="fill:#000000;fill-opacity:1"
     transform="translate(-73.691498,-265.76172)">
    <use
       height="100%"
       width="100%"
       id="use182"
       y="279.23999"
       x="490.63"
       xlink:href="#glyph0-9" />
    <use
       height="100%"
       width="100%"
       id="use184"
       y="279.23999"
       x="499.55801"
       xlink:href="#glyph0-18" />
    <use
       height="100%"
       width="100%"
       id="use186"
       y="279.23999"
       x="509.58401"
       xlink:href="#glyph0-7" />
    <use
       height="100%"
       width="100%"
       id="use188"
       y="279.23999"
       x="518.15198"
       xlink:href="#glyph0-19" />
    <use
       height="100%"
       width="100%"
       id="use190"
       y="279.23999"
       x="529.61798"
       xlink:href="#glyph0-18" />
  </g>
  <g
     id="g192"
     style="fill:#000000;fill-opacity:1"
     transform="translate(-73.691498,-265.76172)">
    <use
       height="100%"
       width="100%"
       id="use194"
       y="279.23999"
       x="539.698"
       xlink:href="#glyph0-3" />
    <use
       height="100%"
       width="100%"
       id="use196"
       y="279.23999"
       x="546.80798"
       xlink:href="#glyph0-20" />
    <use
       height="100%"
       width="100%"
       id="use198"
       y="279.23999"
       x="552.51398"
       xlink:href="#glyph0-6" />
  </g>
</svg>
