<?xml version="1.0" encoding="UTF-8" standalone="no"?>
<!-- Created with Inkscape (http://www.inkscape.org/) -->

<svg
   xmlns:dc="http://purl.org/dc/elements/1.1/"
   xmlns:cc="http://creativecommons.org/ns#"
   xmlns:rdf="http://www.w3.org/1999/02/22-rdf-syntax-ns#"
   xmlns:svg="http://www.w3.org/2000/svg"
   xmlns="http://www.w3.org/2000/svg"
   xmlns:sodipodi="http://sodipodi.sourceforge.net/DTD/sodipodi-0.dtd"
   xmlns:inkscape="http://www.inkscape.org/namespaces/inkscape"
   width="103.35415mm"
   height="47.924107mm"
   viewBox="0 0 366.21549 169.80983"
   id="svg5179"
   version="1.1"
   inkscape:version="0.91 r13725"
   sodipodi:docname="AT-S.svg">
  <defs
     id="defs5181">
    <clipPath
       clipPathUnits="userSpaceOnUse"
       id="clipPath4624">
      <path
         d="M 0,0 720,0 720,540 0,540 0,0 Z"
         id="path4626"
         inkscape:connector-curvature="0" />
    </clipPath>
  </defs>
  <sodipodi:namedview
     id="base"
     pagecolor="#ffffff"
     bordercolor="#666666"
     borderopacity="1.0"
     inkscape:pageopacity="0.0"
     inkscape:pageshadow="2"
     inkscape:zoom="1.979899"
     inkscape:cx="216.54906"
     inkscape:cy="55.835845"
     inkscape:document-units="px"
     inkscape:current-layer="layer1"
     showgrid="false"
     fit-margin-top="0"
     fit-margin-left="0"
     fit-margin-right="0"
     fit-margin-bottom="0"
     inkscape:window-width="1920"
     inkscape:window-height="1138"
     inkscape:window-x="-8"
     inkscape:window-y="-8"
     inkscape:window-maximized="1" />
  <metadata
     id="metadata5184">
    <rdf:RDF>
      <cc:Work
         rdf:about="">
        <dc:format>image/svg+xml</dc:format>
        <dc:type
           rdf:resource="http://purl.org/dc/dcmitype/StillImage" />
        <dc:title></dc:title>
      </cc:Work>
    </rdf:RDF>
  </metadata>
  <g
     inkscape:label="Layer 1"
     inkscape:groupmode="layer"
     id="layer1"
     transform="translate(-54.035125,-47.457294)">
    <g
       id="g4494"
       transform="matrix(1.25,0,0,-1.25,140.66034,117.46454)">
      <path
         d="M 0,0 96.286,0"
         style="fill:none;stroke:#bbe0e3;stroke-width:4.5;stroke-linecap:butt;stroke-linejoin:round;stroke-miterlimit:10;stroke-dasharray:none;stroke-opacity:1"
         id="path4496"
         inkscape:connector-curvature="0" />
    </g>
    <path
       d="m 277.25248,83.360794 12.97375,0 0,69.379996 -12.97375,0 0,-69.379996 z"
       style="fill:#f1f9f9;fill-opacity:1;fill-rule:evenodd;stroke:none"
       id="path4498"
       inkscape:connector-curvature="0" />
    <g
       id="g4500"
       transform="matrix(1.25,0,0,-1.25,290.22635,88.768914)">
      <path
         d="M 0,0 75.433,0 0,-50.201 0,0 Z"
         style="fill:#f1f9f9;fill-opacity:1;fill-rule:evenodd;stroke:none"
         id="path4502"
         inkscape:connector-curvature="0" />
    </g>
    <path
       d="m 282.55248,48.707044 136.4475,0 0,90.992496 -136.4475,0 0,-90.992496 z"
       style="fill:#f1f9f9;fill-opacity:1;fill-rule:evenodd;stroke:none"
       id="path4504"
       inkscape:connector-curvature="0" />
    <g
       id="g4506"
       transform="matrix(1.25,0,0,-1.25,419.00073,48.707294)">
      <path
         d="M 0,0 -108.638,0"
         style="fill:none;stroke:#bbe0e3;stroke-width:2;stroke-linecap:butt;stroke-linejoin:round;stroke-miterlimit:10;stroke-dasharray:none;stroke-opacity:1"
         id="path4508"
         inkscape:connector-curvature="0" />
    </g>
    <text
       y="78.756172"
       x="329.91458"
       style="font-variant:normal;font-weight:bold;font-stretch:normal;font-size:13.80000019px;font-family:Arial;-inkscape-font-specification:Helvetica-Bold;writing-mode:lr-tb;fill:#000000;fill-opacity:1;fill-rule:nonzero;stroke:none"
       id="text4510">
      <tspan
         x="329.91458 339.064 347.4682 355.87241 359.7778 368.18201 375.82721"
         y="78.756172"
         sodipodi:role="line"
         id="tspan4512">Engine</tspan>
    </text>
    <g
       id="g4514"
       transform="matrix(1.25,0,0,-1.25,419.0006,137.80454)">
      <path
         d="M 0,0 0,71.049"
         style="fill:none;stroke:#bbe0e3;stroke-width:2;stroke-linecap:butt;stroke-linejoin:round;stroke-miterlimit:10;stroke-dasharray:none;stroke-opacity:1"
         id="path4516"
         inkscape:connector-curvature="0" />
    </g>
    <g
       id="g4518"
       transform="matrix(1.25,0,0,-1.25,311.93148,137.51829)">
      <path
         d="M 0,0 85.655,0"
         style="fill:none;stroke:#bbe0e3;stroke-width:2;stroke-linecap:butt;stroke-linejoin:round;stroke-miterlimit:10;stroke-dasharray:none;stroke-opacity:1"
         id="path4520"
         inkscape:connector-curvature="0" />
    </g>
    <g
       id="g4522"
       transform="matrix(1.25,0,0,-1.25,311.93148,137.51829)">
      <path
         d="M 0,0 -17.364,-11.202"
         style="fill:none;stroke:#bbe0e3;stroke-width:2;stroke-linecap:butt;stroke-linejoin:round;stroke-miterlimit:10;stroke-dasharray:none;stroke-opacity:1"
         id="path4524"
         inkscape:connector-curvature="0" />
    </g>
    <g
       id="g4526"
       transform="matrix(1.25,0,0,-1.25,282.55298,83.157044)">
      <path
         d="M 0,0 0,27.598"
         style="fill:none;stroke:#bbe0e3;stroke-width:2;stroke-linecap:butt;stroke-linejoin:round;stroke-miterlimit:10;stroke-dasharray:none;stroke-opacity:1"
         id="path4528"
         inkscape:connector-curvature="0" />
    </g>
    <g
       id="g4530"
       transform="matrix(1.25,0,0,-1.25,290.69323,152.54404)">
      <path
         d="M 0,0 -10.752,0"
         style="fill:none;stroke:#bbe0e3;stroke-width:2;stroke-linecap:butt;stroke-linejoin:round;stroke-miterlimit:10;stroke-dasharray:none;stroke-opacity:1"
         id="path4532"
         inkscape:connector-curvature="0" />
    </g>
    <g
       id="g4534"
       transform="matrix(1.25,0,0,-1.25,282.67573,82.070794)">
      <path
         d="M 0,0 -4.338,0"
         style="fill:none;stroke:#bbe0e3;stroke-width:2;stroke-linecap:butt;stroke-linejoin:round;stroke-miterlimit:10;stroke-dasharray:none;stroke-opacity:1"
         id="path4536"
         inkscape:connector-curvature="0" />
    </g>
    <path
       d="m 157.79997,93.637044 91.73501,0 0,45.389996 -91.73501,0 0,-45.389996 z"
       style="fill:#f1f9f9;fill-opacity:1;fill-rule:evenodd;stroke:none"
       id="path4538"
       inkscape:connector-curvature="0" />
    <path
       d="m 163.87247,126.63954 109.24251,0 0,26.10125 -109.24251,0 0,-26.10125 z"
       style="fill:#f1f9f9;fill-opacity:1;fill-rule:evenodd;stroke:none"
       id="path4540"
       inkscape:connector-curvature="0" />
    <g
       id="g4542"
       transform="matrix(1.25,0,0,-1.25,157.79984,99.234924)">
      <path
         d="M 0,0 -6.482,0 0,4.394 0,0 Z"
         style="fill:#f1f9f9;fill-opacity:1;fill-rule:evenodd;stroke:none"
         id="path4544"
         inkscape:connector-curvature="0" />
    </g>
    <path
       d="m 149.69747,99.234544 21.2625,0 0,34.631246 -21.2625,0 0,-34.631246 z"
       style="fill:#f1f9f9;fill-opacity:1;fill-rule:evenodd;stroke:none"
       id="path4546"
       inkscape:connector-curvature="0" />
    <g
       id="g4548"
       transform="matrix(1.25,0,0,-1.25,157.79997,133.86679)">
      <path
         d="M 0,0 -6.482,0 0,-4.397 0,0 Z"
         style="fill:#f1f9f9;fill-opacity:1;fill-rule:evenodd;stroke:none"
         id="path4550"
         inkscape:connector-curvature="0" />
    </g>
    <path
       d="m 146.15372,107.19329 21.2625,0 0,18.715 -21.2625,0 0,-18.715 z"
       style="fill:#f1f9f9;fill-opacity:1;fill-rule:evenodd;stroke:none"
       id="path4552"
       inkscape:connector-curvature="0" />
    <g
       id="g4554"
       transform="matrix(1.25,0,0,-1.25,249.76973,96.551164)">
      <path
         d="M 0,0 -19.061,0 0,11.52 0,0 Z"
         style="fill:#f1f9f9;fill-opacity:1;fill-rule:evenodd;stroke:none"
         id="path4556"
         inkscape:connector-curvature="0" />
    </g>
    <path
       d="m 248.92123,82.922044 24.19375,0 0,48.058746 -24.19375,0 0,-48.058746 z"
       style="fill:#f1f9f9;fill-opacity:1;fill-rule:evenodd;stroke:none"
       id="path4558"
       inkscape:connector-curvature="0" />
    <g
       id="g4560"
       transform="matrix(1.25,0,0,-1.25,273.07898,82.160664)">
      <path
         d="M 0,0 -19.321,0"
         style="fill:none;stroke:#bbe0e3;stroke-width:2;stroke-linecap:butt;stroke-linejoin:round;stroke-miterlimit:10;stroke-dasharray:none;stroke-opacity:1"
         id="path4562"
         inkscape:connector-curvature="0" />
    </g>
    <g
       id="g4564"
       transform="matrix(1.25,0,0,-1.25,273.11485,152.54404)">
      <path
         d="M 0,0 -87.394,0"
         style="fill:none;stroke:#bbe0e3;stroke-width:2;stroke-linecap:butt;stroke-linejoin:round;stroke-miterlimit:10;stroke-dasharray:none;stroke-opacity:1"
         id="path4566"
         inkscape:connector-curvature="0" />
    </g>
    <g
       id="g4568"
       transform="matrix(1.25,0,0,-1.25,249.53535,82.070794)">
      <path
         d="M 0,0 -14.864,-9.338"
         style="fill:none;stroke:#bbe0e3;stroke-width:2;stroke-linecap:butt;stroke-linejoin:round;stroke-miterlimit:10;stroke-dasharray:none;stroke-opacity:1"
         id="path4570"
         inkscape:connector-curvature="0" />
    </g>
    <g
       id="g4572"
       transform="matrix(1.25,0,0,-1.25,232.44248,93.742664)">
      <path
         d="M 0,0 -60.526,0"
         style="fill:none;stroke:#bbe0e3;stroke-width:2;stroke-linecap:butt;stroke-linejoin:round;stroke-miterlimit:10;stroke-dasharray:none;stroke-opacity:1"
         id="path4574"
         inkscape:connector-curvature="0" />
    </g>
    <g
       id="g4576"
       transform="matrix(1.25,0,0,-1.25,158.33609,93.398914)">
      <path
         d="M 0,0 -6.911,-4.669"
         style="fill:none;stroke:#bbe0e3;stroke-width:2;stroke-linecap:butt;stroke-linejoin:round;stroke-miterlimit:10;stroke-dasharray:none;stroke-opacity:1"
         id="path4578"
         inkscape:connector-curvature="0" />
    </g>
    <g
       id="g4580"
       transform="matrix(1.25,0,0,-1.25,149.69747,107.91754)">
      <path
         d="M 0,0 -2.835,0"
         style="fill:none;stroke:#bbe0e3;stroke-width:2;stroke-linecap:butt;stroke-linejoin:round;stroke-miterlimit:10;stroke-dasharray:none;stroke-opacity:1"
         id="path4582"
         inkscape:connector-curvature="0" />
    </g>
    <g
       id="g4584"
       transform="matrix(1.25,0,0,-1.25,149.69735,126.64004)">
      <path
         d="M 0,0 -2.835,0"
         style="fill:none;stroke:#bbe0e3;stroke-width:2;stroke-linecap:butt;stroke-linejoin:round;stroke-miterlimit:10;stroke-dasharray:none;stroke-opacity:1"
         id="path4586"
         inkscape:connector-curvature="0" />
    </g>
    <g
       id="g4588"
       transform="matrix(1.25,0,0,-1.25,229.1081,139.80579)">
      <path
         d="M 0,0 -56.617,0"
         style="fill:none;stroke:#bbe0e3;stroke-width:2;stroke-linecap:butt;stroke-linejoin:round;stroke-miterlimit:10;stroke-dasharray:none;stroke-opacity:1"
         id="path4590"
         inkscape:connector-curvature="0" />
    </g>
    <g
       id="g4592"
       transform="matrix(1.25,0,0,-1.25,149.69735,107.91754)">
      <path
         d="M 0,0 0,6.946"
         style="fill:none;stroke:#bbe0e3;stroke-width:2;stroke-linecap:butt;stroke-linejoin:round;stroke-miterlimit:10;stroke-dasharray:none;stroke-opacity:1"
         id="path4594"
         inkscape:connector-curvature="0" />
    </g>
    <g
       id="g4596"
       transform="matrix(1.25,0,0,-1.25,149.69735,135.32267)">
      <path
         d="M 0,0 0,6.946"
         style="fill:none;stroke:#bbe0e3;stroke-width:2;stroke-linecap:butt;stroke-linejoin:round;stroke-miterlimit:10;stroke-dasharray:none;stroke-opacity:1"
         id="path4598"
         inkscape:connector-curvature="0" />
    </g>
    <g
       id="g4600"
       transform="matrix(1.25,0,0,-1.25,158.33609,139.69929)">
      <path
         d="M 0,0 -6.911,3.988"
         style="fill:none;stroke:#bbe0e3;stroke-width:2;stroke-linecap:butt;stroke-linejoin:round;stroke-miterlimit:10;stroke-dasharray:none;stroke-opacity:1"
         id="path4602"
         inkscape:connector-curvature="0" />
    </g>
    <g
       id="g4604"
       transform="matrix(1.25,0,0,-1.25,163.87209,153.20179)">
      <path
         d="M 0,0 0,10.717"
         style="fill:none;stroke:#bbe0e3;stroke-width:2;stroke-linecap:butt;stroke-linejoin:round;stroke-miterlimit:10;stroke-dasharray:none;stroke-opacity:1"
         id="path4606"
         inkscape:connector-curvature="0" />
    </g>
    <g
       id="g4608"
       transform="matrix(1.25,0,0,-1.25,146.15484,126.64016)">
      <path
         d="M 0,0 0,15.193"
         style="fill:none;stroke:#bbe0e3;stroke-width:2;stroke-linecap:butt;stroke-linejoin:round;stroke-miterlimit:10;stroke-dasharray:none;stroke-opacity:1"
         id="path4610"
         inkscape:connector-curvature="0" />
    </g>
    <g
       id="g4612"
       transform="matrix(1.25,0,0,-1.25,277.25273,152.54404)">
      <path
         d="M 0,0 0,56.248"
         style="fill:none;stroke:#bbe0e3;stroke-width:2;stroke-linecap:butt;stroke-linejoin:round;stroke-miterlimit:10;stroke-dasharray:none;stroke-opacity:1"
         id="path4614"
         inkscape:connector-curvature="0" />
    </g>
    <g
       id="g4616"
       transform="matrix(1.25,0,0,-1.25,272.33985,152.77841)">
      <path
         d="M 0,0 0,56.248"
         style="fill:none;stroke:#bbe0e3;stroke-width:2;stroke-linecap:butt;stroke-linejoin:round;stroke-miterlimit:10;stroke-dasharray:none;stroke-opacity:1"
         id="path4618"
         inkscape:connector-curvature="0" />
    </g>
    <g
       transform="matrix(1.25,0,0,-1.25,-17.411274,549.16954)"
       id="g4620">
      <g
         id="g4622"
         clip-path="url(#clipPath4624)">
        <g
           id="g4628"
           transform="translate(231.7114,369.538)">
          <path
             d="m 0,0 c 4.914,0 8.897,-3.983 8.897,-8.897 l 0,-30.434 c 0,-4.913 -3.983,-8.897 -8.897,-8.897 l -6.337,0 c -4.914,0 -8.897,3.984 -8.897,8.897 l 0,30.434 c 0,4.914 3.983,8.897 8.897,8.897 L 0,0 Z"
             style="fill:#990000;fill-opacity:1;fill-rule:evenodd;stroke:#000000;stroke-width:1.5;stroke-linecap:butt;stroke-linejoin:round;stroke-miterlimit:10;stroke-dasharray:none;stroke-opacity:1"
             id="path4630"
             inkscape:connector-curvature="0" />
        </g>
      </g>
    </g>
    <text
       y="122.19567"
       x="259.28598"
       style="font-variant:normal;font-weight:bold;font-stretch:normal;font-size:13.80000019px;font-family:Arial;-inkscape-font-specification:Helvetica-Bold;writing-mode:lr-tb;fill:#ffffff;fill-opacity:1;fill-rule:nonzero;stroke:none"
       id="text4632">
      <tspan
         x="259.28598 267.53836 277.43298"
         y="122.19567"
         sodipodi:role="line"
         id="tspan4634">TC</tspan>
    </text>
    <text
       y="198.22404"
       x="302.97998"
       style="font-variant:normal;font-weight:bold;font-stretch:normal;font-size:15px;font-family:Arial;-inkscape-font-specification:Helvetica-Bold;writing-mode:lr-tb;fill:#c0c0c0;fill-opacity:1;fill-rule:nonzero;stroke:none"
       id="text4636">
      <tspan
         x="302.97998"
         y="198.22404"
         id="tspan4638">n</tspan>
    </text>
    <text
       y="201.82405"
       x="312.12997"
       style="font-variant:normal;font-weight:bold;font-stretch:normal;font-size:10.05000019px;font-family:Arial;-inkscape-font-specification:Helvetica-Bold;writing-mode:lr-tb;fill:#c0c0c0;fill-opacity:1;fill-rule:nonzero;stroke:none"
       id="text4640">
      <tspan
         x="312.12997 314.98416"
         y="201.82405"
         sodipodi:role="line"
         id="tspan4642">in</tspan>
    </text>
    <text
       y="198.22404"
       x="321.12997"
       style="font-variant:normal;font-weight:bold;font-stretch:normal;font-size:15px;font-family:Arial;-inkscape-font-specification:Helvetica-Bold;writing-mode:lr-tb;fill:#c0c0c0;fill-opacity:1;fill-rule:nonzero;stroke:none"
       id="text4644">
      <tspan
         x="321.12997 325.32999"
         y="198.22404"
         sodipodi:role="line"
         id="tspan4646">,</tspan>
    </text>
    <text
       y="198.22404"
       x="329.52997"
       style="font-variant:normal;font-weight:bold;font-stretch:normal;font-size:15px;font-family:Calibri;-inkscape-font-specification:Calibri-Bold;writing-mode:lr-tb;fill:#c0c0c0;fill-opacity:1;fill-rule:nonzero;stroke:none"
       id="text4648">
      <tspan
         x="329.52997"
         y="198.22404"
         id="tspan4650">T</tspan>
    </text>
    <text
       y="201.82405"
       x="337.02997"
       style="font-variant:normal;font-weight:bold;font-stretch:normal;font-size:10.05000019px;font-family:Calibri;-inkscape-font-specification:Calibri-Bold;writing-mode:lr-tb;fill:#c0c0c0;fill-opacity:1;fill-rule:nonzero;stroke:none"
       id="text4652">
      <tspan
         x="337.02997 339.43192"
         y="201.82405"
         sodipodi:role="line"
         id="tspan4654">in</tspan>
    </text>
    <text
       y="197.71242"
       x="199.39635"
       style="font-variant:normal;font-weight:bold;font-stretch:normal;font-size:15px;font-family:Arial;-inkscape-font-specification:Helvetica-Bold;writing-mode:lr-tb;fill:#222268;fill-opacity:1;fill-rule:nonzero;stroke:none"
       id="text4656">
      <tspan
         x="199.39635"
         y="197.71242"
         id="tspan4658">n</tspan>
    </text>
    <text
       y="201.3123"
       x="208.54633"
       style="font-variant:normal;font-weight:bold;font-stretch:normal;font-size:10.05000019px;font-family:Arial;-inkscape-font-specification:Helvetica-Bold;writing-mode:lr-tb;fill:#222268;fill-opacity:1;fill-rule:nonzero;stroke:none"
       id="text4660">
      <tspan
         x="208.54633 214.69695 220.84755"
         y="201.3123"
         sodipodi:role="line"
         id="tspan4662">out</tspan>
    </text>
    <text
       y="197.71242"
       x="224.14636"
       style="font-variant:normal;font-weight:bold;font-stretch:normal;font-size:15px;font-family:Arial;-inkscape-font-specification:Helvetica-Bold;writing-mode:lr-tb;fill:#222268;fill-opacity:1;fill-rule:nonzero;stroke:none"
       id="text4664">
      <tspan
         x="224.14636 228.34636"
         y="197.71242"
         sodipodi:role="line"
         id="tspan4666">,</tspan>
    </text>
    <text
       y="197.71242"
       x="232.54633"
       style="font-variant:normal;font-weight:bold;font-stretch:normal;font-size:15px;font-family:Calibri;-inkscape-font-specification:Calibri-Bold;writing-mode:lr-tb;fill:#222268;fill-opacity:1;fill-rule:nonzero;stroke:none"
       id="text4668">
      <tspan
         x="232.54633"
         y="197.71242"
         id="tspan4670">T</tspan>
    </text>
    <text
       y="201.3123"
       x="238.69633"
       style="font-variant:normal;font-weight:bold;font-stretch:normal;font-size:10.05000019px;font-family:Calibri;-inkscape-font-specification:Calibri-Bold;writing-mode:lr-tb;fill:#222268;fill-opacity:1;fill-rule:nonzero;stroke:none"
       id="text4672">
      <tspan
         x="238.69633 244.09319 249.49004"
         y="201.3123"
         sodipodi:role="line"
         id="tspan4674">out</tspan>
    </text>
    <g
       id="g4676"
       transform="matrix(1.25,0,0,-1.25,227.08498,176.85154)">
      <path
         d="M 0,0 11.953,40.755"
         style="fill:none;stroke:#000000;stroke-width:1;stroke-linecap:butt;stroke-linejoin:round;stroke-miterlimit:10;stroke-dasharray:none;stroke-opacity:1"
         id="path4678"
         inkscape:connector-curvature="0" />
    </g>
    <g
       id="g4680"
       transform="matrix(1.25,0,0,-1.25,322.10498,174.56041)">
      <path
         d="M 0,0 -13.501,38.352"
         style="fill:none;stroke:#000000;stroke-width:1;stroke-linecap:butt;stroke-linejoin:round;stroke-miterlimit:10;stroke-dasharray:none;stroke-opacity:1"
         id="path4682"
         inkscape:connector-curvature="0" />
    </g>
    <g
       id="g4684"
       transform="matrix(1.25,0,0,-1.25,311.12036,116.33191)">
      <path
         d="M 0,0 -15.352,0"
         style="fill:none;stroke:#000000;stroke-width:1;stroke-linecap:butt;stroke-linejoin:round;stroke-miterlimit:10;stroke-dasharray:none;stroke-opacity:1"
         id="path4686"
         inkscape:connector-curvature="0" />
    </g>
    <g
       id="g4688"
       transform="matrix(1.25,0,0,-1.25,299.43048,111.95654)">
      <path
         d="M 0,0 -6,-3.5 0,-7"
         style="fill:none;stroke:#000000;stroke-width:1;stroke-linecap:round;stroke-linejoin:miter;stroke-miterlimit:10;stroke-dasharray:none;stroke-opacity:1"
         id="path4690"
         inkscape:connector-curvature="0" />
    </g>
    <g
       id="g4692"
       transform="matrix(1.25,0,0,-1.25,249.53535,116.55066)">
      <path
         d="M 0,0 -15.352,0"
         style="fill:none;stroke:#000000;stroke-width:1;stroke-linecap:butt;stroke-linejoin:round;stroke-miterlimit:10;stroke-dasharray:none;stroke-opacity:1"
         id="path4694"
         inkscape:connector-curvature="0" />
    </g>
    <g
       id="g4696"
       transform="matrix(1.25,0,0,-1.25,237.84548,112.17529)">
      <path
         d="M 0,0 -6,-3.5 0,-7"
         style="fill:none;stroke:#000000;stroke-width:1;stroke-linecap:round;stroke-linejoin:miter;stroke-miterlimit:10;stroke-dasharray:none;stroke-opacity:1"
         id="path4698"
         inkscape:connector-curvature="0" />
    </g>
    <g
       id="g4700"
       transform="matrix(1.25,0,0,-1.25,134.75522,117.09441)">
      <path
         d="M 0,0 -15.352,0"
         style="fill:none;stroke:#000000;stroke-width:1;stroke-linecap:butt;stroke-linejoin:round;stroke-miterlimit:10;stroke-dasharray:none;stroke-opacity:1"
         id="path4702"
         inkscape:connector-curvature="0" />
    </g>
    <g
       id="g4704"
       transform="matrix(1.25,0,0,-1.25,123.06534,112.71904)">
      <path
         d="M 0,0 -6,-3.5 0,-7"
         style="fill:none;stroke:#000000;stroke-width:1;stroke-linecap:round;stroke-linejoin:miter;stroke-miterlimit:10;stroke-dasharray:none;stroke-opacity:1"
         id="path4706"
         inkscape:connector-curvature="0" />
    </g>
    <text
       y="186.41142"
       x="53.591351"
       style="font-variant:normal;font-weight:bold;font-stretch:normal;font-size:12.44999981px;font-family:Calibri;-inkscape-font-specification:Calibri-Bold;writing-mode:lr-tb;fill:#808080;fill-opacity:1;fill-rule:nonzero;stroke:none"
       id="text4708">
      <tspan
         x="53.591351 61.534447 67.834145 73.984451 78.478897 85.226799 91.974693 97.689247 100.2415 108.64525 115.39314"
         y="186.41142"
         sodipodi:role="line"
         id="tspan4710">Gearbox Out</tspan>
    </text>
    <g
       id="g4712"
       transform="matrix(1.25,0,0,-1.25,100.17897,165.48992)">
      <path
         d="M 0,0 19.49,28.316"
         style="fill:none;stroke:#808080;stroke-width:1;stroke-linecap:butt;stroke-linejoin:round;stroke-miterlimit:10;stroke-dasharray:none;stroke-opacity:1"
         id="path4714"
         inkscape:connector-curvature="0" />
    </g>
    <text
       y="217.1273"
       x="199.63272"
       style="font-variant:normal;font-weight:bold;font-stretch:normal;font-size:12.44999981px;font-family:Calibri;-inkscape-font-specification:Calibri-Bold;writing-mode:lr-tb;fill:#808080;fill-opacity:1;fill-rule:nonzero;stroke:none"
       id="text4716">
      <tspan
         x="199.63272 205.78302 208.63408 216.58963 222.88933 229.03963 233.53407 240.28197 247.02986 252.73196 255.43361 258.73288"
         y="217.1273"
         sodipodi:role="line"
         id="tspan4718">= Gearbox In</tspan>
    </text>
  </g>
</svg>
