<svg>
<defs>

<svg id="settings" width="16" height="17" viewBox="0 0 16 17" fill="#656E76" xmlns="http://www.w3.org/2000/svg">
<g clip-path="url(#clip0_4_1299)">
<path d="M12.7604 9.12398C12.7844 8.92398 12.8004 8.71598 12.8004 8.49998C12.8004 8.28398 12.7844 8.07598 12.7524 7.87598L14.1044 6.81998C14.2244 6.72398 14.2564 6.54798 14.1844 6.41198L12.9044 4.19598C12.8244 4.05198 12.6564 4.00398 12.5124 4.05198L10.9204 4.69198C10.5844 4.43598 10.2324 4.22798 9.8404 4.06798L9.6004 2.37198C9.5764 2.21198 9.4404 2.09998 9.2804 2.09998H6.7204C6.5604 2.09998 6.4324 2.21198 6.4084 2.37198L6.1684 4.06798C5.7764 4.22798 5.4164 4.44398 5.0884 4.69198L3.4964 4.05198C3.3524 3.99598 3.1844 4.05198 3.1044 4.19598L1.8244 6.41198C1.7444 6.55598 1.7764 6.72398 1.9044 6.81998L3.2564 7.87598C3.2244 8.07598 3.2004 8.29198 3.2004 8.49998C3.2004 8.70798 3.2164 8.92398 3.2484 9.12398L1.8964 10.18C1.7764 10.276 1.7444 10.452 1.8164 10.588L3.0964 12.804C3.1764 12.948 3.3444 12.996 3.4884 12.948L5.0804 12.308C5.4164 12.564 5.7684 12.772 6.1604 12.932L6.4004 14.628C6.4324 14.788 6.5604 14.9 6.7204 14.9H9.2804C9.4404 14.9 9.5764 14.788 9.5924 14.628L9.8324 12.932C10.2244 12.772 10.5844 12.556 10.9124 12.308L12.5044 12.948C12.6484 13.004 12.8164 12.948 12.8964 12.804L14.1764 10.588C14.2564 10.444 14.2244 10.276 14.0964 10.18L12.7604 9.12398ZM8.0004 10.9C6.6804 10.9 5.6004 9.81998 5.6004 8.49998C5.6004 7.17998 6.6804 6.09998 8.0004 6.09998C9.3204 6.09998 10.4004 7.17998 10.4004 8.49998C10.4004 9.81998 9.3204 10.9 8.0004 10.9Z" fill="currentColor"/>
</g>
<defs>
<clipPath id="clip0_4_1299">
<rect width="16" height="16" fill="white" transform="translate(0 0.5)"/>
</clipPath>
</defs>
</svg>



<svg id="seo" width="16" height="17" viewBox="0 0 16 17" fill="#656E76" xmlns="http://www.w3.org/2000/svg">
<path d="M15.1823 14.58L12.7646 12.0911C13.1557 11.5578 13.369 10.8822 13.369 10.2067C13.369 8.39333 11.8757 6.86444 10.0268 6.86444C8.1779 6.86444 6.68457 8.35777 6.68457 10.2067C6.68457 12.0556 8.1779 13.5489 10.0268 13.5489C10.7379 13.5489 11.3779 13.3356 11.9112 12.9444L14.329 15.4333C14.4357 15.54 14.6135 15.5756 14.7557 15.5756C14.8979 15.5756 15.0757 15.54 15.1823 15.4333C15.289 15.3267 15.3246 15.1489 15.3246 15.0067C15.3601 14.8644 15.289 14.7222 15.1823 14.58ZM10.0623 12.1622C8.99568 12.1622 8.14235 11.3089 8.14235 10.2422C8.14235 9.17555 8.99568 8.32222 10.0623 8.32222C11.129 8.32222 11.9823 9.17555 11.9823 10.2422C11.9823 11.3089 11.0935 12.1622 10.0623 12.1622Z" fill="currentColor"/>
<path d="M15.0751 2.20667H0.959557C0.532891 2.20667 0.212891 2.59778 0.212891 2.95333V6.9C0.212891 7.32666 0.532891 7.64667 0.959557 7.64667H6.47067C7.21734 6.47333 8.56845 5.69111 10.0618 5.69111C11.5551 5.69111 12.9062 6.47333 13.6529 7.64667H15.0396C15.4662 7.64667 15.7862 7.32666 15.7862 6.9V2.95333C15.8218 2.56222 15.4662 2.20667 15.0751 2.20667Z" fill="currentColor"/>
<path d="M1.38672 6.47334V3.41556C1.38672 3.16667 1.60005 2.98889 1.81339 2.98889C2.06227 2.98889 2.24005 3.20222 2.24005 3.41556V6.47334C2.24005 6.72222 2.02672 6.9 1.81339 6.9C1.60005 6.9 1.38672 6.72222 1.38672 6.47334Z" fill="white"/>
</svg>

</defs>
</svg>
