<svg width="28" height="28" viewBox="0 0 400 400" fill="none" xmlns="http://www.w3.org/2000/svg">
<g clip-path="url(#clip0_570_167)">
<path d="M200 400C310.457 400 400 310.457 400 200C400 89.5431 310.457 0 200 0C89.5431 0 0 89.5431 0 200C0 310.457 89.5431 400 200 400Z" fill="#002B6E"/>
<mask id="mask0_570_167" style="mask-type:luminance" maskUnits="userSpaceOnUse" x="0" y="0" width="400" height="400">
<path d="M200 400C310.457 400 400 310.457 400 200C400 89.5431 310.457 0 200 0C89.5431 0 0 89.5431 0 200C0 310.457 89.5431 400 200 400Z" fill="white"/>
</mask>
<g mask="url(#mask0_570_167)">
<g opacity="0.35">
<path d="M7.38965 -5.26953V77.7905" stroke="#51E7F9" stroke-width="3" stroke-miterlimit="10" stroke-linecap="round"/>
<path d="M7.38988 145.19C-9.83011 145.19 -25.4901 138.16 -36.7401 126.91C-47.9901 115.66 -55.0201 100 -55.0201 82.7803V41.6203C-55.0201 30.1303 -64.3301 20.8203 -75.8201 20.8203C-87.3101 20.8203 -96.6201 30.1303 -96.6201 41.6203V121.06" stroke="#51E7F9" stroke-width="3" stroke-miterlimit="10" stroke-linecap="round"/>
<path d="M254.32 -111.109V110.061" stroke="#51E7F9" stroke-width="3" stroke-miterlimit="10" stroke-linecap="round"/>
<path d="M7.38984 103.581C-4.10016 103.581 -13.4102 94.2712 -13.4102 82.7812V-44.7188" stroke="#51E7F9" stroke-width="3" stroke-miterlimit="10" stroke-linecap="round"/>
<path d="M153.01 -64.7891V58.6509" stroke="#01BBA6" stroke-width="3" stroke-miterlimit="10" stroke-linecap="round"/>
<path d="M88.0698 160.141C76.7998 171.411 69.7898 187.041 69.7898 204.271" stroke="#01BBA6" stroke-width="3" stroke-miterlimit="10" stroke-linecap="round"/>
<path d="M194.61 245.879V204.269C194.61 187.039 187.6 171.409 176.33 160.139C165.06 148.869 149.43 141.859 132.2 141.859" stroke="#01BBA6" stroke-width="3" stroke-miterlimit="10" stroke-linecap="round"/>
<path d="M132.2 260.859V335.749C132.2 358.729 113.57 377.359 90.59 377.359C67.61 377.359 48.98 358.729 48.98 335.749V290.819" stroke="#01BBA6" stroke-width="3" stroke-miterlimit="10" stroke-linecap="round"/>
<path d="M225.82 422.01C197.1 422.01 173.81 398.73 173.81 370V204.27C173.81 181.29 155.18 162.66 132.2 162.66C109.22 162.66 90.5898 181.29 90.5898 204.27V323.26" stroke="#A9278A" stroke-width="3" stroke-miterlimit="10" stroke-linecap="round"/>
<path opacity="0.25" d="M277.83 75.8906V259.611" stroke="#51E7F9" stroke-width="3" stroke-miterlimit="10" stroke-linecap="round"/>
<path opacity="0.25" d="M215.42 -64.7891V129.381" stroke="#51E7F9" stroke-width="3" stroke-miterlimit="10" stroke-linecap="round"/>
<path d="M277.83 -76.2695V75.8905" stroke="#FF9700" stroke-width="3" stroke-miterlimit="10" stroke-linecap="round"/>
<path opacity="0.25" d="M348.5 164.541V20.1114C348.5 8.63141 353.18 -1.79859 360.69 -9.30859" stroke="#51E7F9" stroke-width="3" stroke-miterlimit="10" stroke-linecap="round"/>
<path opacity="0.25" d="M369.31 219.833V20.1125C369.31 8.6225 378.62 -0.6875 390.11 -0.6875C401.6 -0.6875 410.91 8.6225 410.91 20.1125V209.732" stroke="#51E7F9" stroke-width="3" stroke-miterlimit="10" stroke-linecap="round"/>
<path opacity="0.25" d="M390.11 -21.4883C401.59 -21.4883 412.02 -16.8083 419.53 -9.29828C427.04 -1.78828 431.72 8.64172 431.72 20.1217V178.482" stroke="#51E7F9" stroke-width="3" stroke-miterlimit="10" stroke-linecap="round"/>
<path d="M46.4698 379.882C35.1998 368.612 28.1898 352.982 28.1898 335.752V196.292C28.1898 184.802 18.8798 175.492 7.38984 175.492C-4.10016 175.492 -13.4102 184.802 -13.4102 196.292V257.752" stroke="#51E7F9" stroke-width="3" stroke-miterlimit="10" stroke-linecap="round"/>
<path d="M381.84 319.11V412.91C381.84 424.4 372.53 433.71 361.04 433.71C349.55 433.71 340.24 424.4 340.24 412.91V311.62C340.24 300.13 330.93 290.82 319.44 290.82C307.95 290.82 298.64 300.13 298.64 311.62V370.01" stroke="#A9278A" stroke-width="3" stroke-miterlimit="10" stroke-linecap="round"/>
<path d="M361.04 391.36V324.93" stroke="#51E7F9" stroke-width="3" stroke-miterlimit="10" stroke-linecap="round"/>
<path d="M7.38965 296.082V370.452" stroke="#51E7F9" stroke-width="3" stroke-miterlimit="10" stroke-linecap="round"/>
<path d="M194.61 315.222V286.102" stroke="#01BBA6" stroke-width="3" stroke-miterlimit="10" stroke-linecap="round"/>
<path opacity="0.25" d="M327.68 -46.2812V104.109" stroke="#51E7F9" stroke-width="3" stroke-miterlimit="10" stroke-linecap="round"/>
<g style="mix-blend-mode:multiply" opacity="0.25">
<path d="M28.1899 -64.7891V82.7809" stroke="#002B6E" stroke-width="3" stroke-miterlimit="10" stroke-linecap="round"/>
<path d="M390.11 157.461V223.271C390.11 237.631 384.27 250.661 374.88 260.051C365.49 269.441 352.46 275.281 338.1 275.281C323.74 275.281 310.71 269.441 301.32 260.051" stroke="#002B6E" stroke-width="3" stroke-miterlimit="10" stroke-linecap="round"/>
</g>
<path d="M48.99 -57.8281V82.7819C48.99 94.2619 44.31 104.692 36.8 112.202C29.29 119.712 18.86 124.392 7.38002 124.392C-4.09998 124.392 -14.53 119.712 -22.04 112.202C-29.55 104.692 -34.23 94.2619 -34.23 82.7819V58.6519" stroke="#A9278A" stroke-width="3" stroke-miterlimit="10" stroke-linecap="round"/>
<path d="M194.61 -64.7891V59.9009C194.61 77.1309 180.64 91.1009 163.41 91.1009C146.18 91.1009 132.21 77.1309 132.21 59.9009V-64.7891" stroke="#A9278A" stroke-width="3" stroke-miterlimit="10" stroke-linecap="round"/>
<path d="M277.83 259.609V370.009C277.83 398.729 254.55 422.019 225.82 422.019" stroke="#FF9700" stroke-width="3" stroke-miterlimit="10" stroke-linecap="round"/>
<path d="M90.6 93.1802V27.8102C90.6 22.0702 85.94 17.4102 80.2 17.4102C74.46 17.4102 69.8 22.0702 69.8 27.8102V82.7802C69.8 100 62.77 115.66 51.52 126.91" stroke="#51E7F9" stroke-width="3" stroke-miterlimit="10" stroke-linecap="round"/>
<path d="M327.7 105.039V175.559" stroke="#51E7F9" stroke-width="3" stroke-miterlimit="10" stroke-linecap="round"/>
<g opacity="0.75">
<path opacity="0.25" d="M298.63 370C296.46 392.75 290.97 407.7 281.85 417.15" stroke="#51E7F9" stroke-width="3" stroke-miterlimit="10" stroke-linecap="round"/>
</g>
<g style="mix-blend-mode:multiply" opacity="0.5">
<path d="M111.4 301.21V335.74C111.4 341.49 109.09 346.66 105.31 350.45C101.53 354.24 96.3498 356.54 90.5998 356.54C84.8498 356.54 79.6798 354.23 75.8898 350.45C72.0998 346.66 69.7998 341.49 69.7998 335.74V215.09" stroke="#002B6E" stroke-width="3" stroke-miterlimit="10" stroke-linecap="round"/>
<path d="M132.2 183.473C126.45 183.473 121.28 185.783 117.49 189.563C113.7 193.353 111.4 198.523 111.4 204.273V245.883" stroke="#002B6E" stroke-width="3" stroke-miterlimit="10" stroke-linecap="round"/>
<path d="M153.01 232.343V204.273" stroke="#002B6E" stroke-width="3" stroke-miterlimit="10" stroke-linecap="round"/>
<path d="M319.43 319.113V370.013C319.43 395.853 308.91 419.313 292.01 436.213" stroke="#002B6E" stroke-width="3" stroke-miterlimit="10" stroke-linecap="round"/>
<path d="M254.32 110.062V346.152C254.32 351.892 249.66 356.552 243.92 356.552C238.18 356.552 233.52 351.892 233.52 346.152V-55.8984" stroke="#002B6E" stroke-width="3" stroke-miterlimit="10" stroke-linecap="round"/>
<path d="M306.9 -18.6992V223.271C306.9 240.501 320.87 254.471 338.1 254.471C355.33 254.471 369.3 240.501 369.3 223.271" stroke="#002B6E" stroke-width="3" stroke-miterlimit="10" stroke-linecap="round"/>
</g>
<path d="M153.03 62.4994C155.14 62.4994 156.85 60.7891 156.85 58.6794C156.85 56.5696 155.14 54.8594 153.03 54.8594C150.92 54.8594 149.21 56.5696 149.21 58.6794C149.21 60.7891 150.92 62.4994 153.03 62.4994Z" fill="#51E7F9"/>
<path d="M298.67 373.827C300.78 373.827 302.49 372.117 302.49 370.008C302.49 367.898 300.78 366.188 298.67 366.188C296.56 366.188 294.85 367.898 294.85 370.008C294.85 372.117 296.56 373.827 298.67 373.827Z" fill="#51E7F9"/>
<path d="M7.40984 149.011C9.51957 149.011 11.2298 147.301 11.2298 145.191C11.2298 143.081 9.51957 141.371 7.40984 141.371C5.30012 141.371 3.58984 143.081 3.58984 145.191C3.58984 147.301 5.30012 149.011 7.40984 149.011Z" fill="#B70E8D"/>
<path d="M277.81 263.3C279.919 263.3 281.63 261.59 281.63 259.48C281.63 257.37 279.919 255.66 277.81 255.66C275.7 255.66 273.99 257.37 273.99 259.48C273.99 261.59 275.7 263.3 277.81 263.3Z" fill="#B70E8D"/>
<path d="M327.71 108.531C329.82 108.531 331.53 106.82 331.53 104.711C331.53 102.601 329.82 100.891 327.71 100.891C325.6 100.891 323.89 102.601 323.89 104.711C323.89 106.82 325.6 108.531 327.71 108.531Z" fill="#51E7F9"/>
<path d="M369.33 224.949C371.439 224.949 373.15 223.238 373.15 221.129C373.15 219.019 371.439 217.309 369.33 217.309C367.22 217.309 365.51 219.019 365.51 221.129C365.51 223.238 367.22 224.949 369.33 224.949Z" fill="#51E7F9"/>
<path d="M254.32 113.8C256.429 113.8 258.14 112.09 258.14 109.98C258.14 107.87 256.429 106.16 254.32 106.16C252.21 106.16 250.5 107.87 250.5 109.98C250.5 112.09 252.21 113.8 254.32 113.8Z" fill="#51E7F9"/>
</g>
</g>
<path d="M200 364.252C174.09 364.252 149.75 354.092 131.44 335.652C113.15 317.232 103.08 292.752 103.08 266.722V266.512C103.08 244.072 111.81 222.972 127.68 207.102L134.78 200.002L127.67 192.892C111.8 177.022 103.07 155.932 103.08 133.492V133.282C103.08 107.252 113.14 82.7717 131.44 64.3517C149.74 45.9117 174.09 35.7617 199.99 35.7617C225.89 35.7617 250.26 45.9217 268.56 64.3617C286.85 82.7817 296.93 107.262 296.92 133.302V133.512C296.92 155.952 288.19 177.052 272.32 192.922L265.22 200.022L272.33 207.132C288.2 223.002 296.93 244.092 296.92 266.532V266.742C296.92 292.772 286.86 317.252 268.56 335.672C250.26 354.112 225.91 364.262 200.01 364.262H199.99L200 364.252Z" fill="#002B6E"/>
<path d="M231.49 161.542C240.2 152.822 244.53 141.442 244.54 130.012C244.54 118.612 240.19 107.252 231.49 98.5422C222.78 89.8322 211.41 85.5022 199.99 85.4922C188.58 85.4922 177.2 89.8322 168.49 98.5422C159.78 107.252 155.45 118.622 155.45 130.042C155.45 139.902 158.69 149.732 165.19 157.842L168.49 161.552L238.49 231.542L241.83 235.212C250.23 245.272 254.45 257.672 254.44 270.042C254.44 283.962 249.12 297.922 238.49 308.542C227.87 319.162 213.91 324.492 199.99 324.492C186.07 324.492 172.11 319.172 161.49 308.542C150.84 297.892 145.54 283.882 145.54 269.942C145.54 256.042 150.9 242.132 161.49 231.542" stroke="#01BBA6" stroke-width="3.77" stroke-miterlimit="10" stroke-linecap="round"/>
<path d="M254.45 130.012C254.45 138.432 252.51 146.872 248.62 154.572" stroke="#01BBA6" stroke-width="3.77" stroke-miterlimit="10" stroke-linecap="round"/>
<path d="M226.83 233.874L161.5 168.544L158.16 164.874C149.77 154.814 145.55 142.414 145.55 130.044C145.55 116.134 150.88 102.164 161.5 91.5438C172.12 80.9238 186.08 75.5938 200 75.5938C213.92 75.5938 227.88 80.9138 238.5 91.5438C245.99 99.0338 250.86 108.184 253.07 117.814" stroke="#51E7F9" stroke-width="3.77" stroke-linecap="round" stroke-linejoin="round"/>
<path d="M156.95 258.512C155.95 262.252 155.45 266.092 155.45 269.942C155.45 281.402 159.78 292.812 168.5 301.542C177.21 310.252 188.58 314.582 200 314.592C211.42 314.592 222.79 310.252 231.5 301.542C240.21 292.832 244.54 281.462 244.55 270.042C244.55 260.182 241.3 250.352 234.81 242.242" stroke="#51E7F9" stroke-width="3.77" stroke-linecap="round" stroke-linejoin="round"/>
<path d="M147.5 322.532C132.99 308.022 125.75 288.952 125.75 269.942C125.75 254.692 130.46 239.432 139.83 226.512" stroke="#51E7F9" stroke-width="3.77" stroke-linecap="round" stroke-linejoin="round"/>
<path d="M224.75 130.033C224.75 123.683 222.34 117.393 217.5 112.543C212.66 107.703 206.35 105.303 200 105.293C193.65 105.293 187.34 107.703 182.5 112.543C177.66 117.383 175.26 123.693 175.25 130.043C175.25 134.813 176.62 139.563 179.34 143.683L182.49 147.533L252.49 217.533L255.86 221.163C268.09 235.123 274.24 252.593 274.24 270.033C274.24 289.023 266.98 308.053 252.49 322.533C238 337.023 218.97 344.283 199.99 344.283C184.45 344.283 168.87 339.423 155.79 329.703" stroke="#51E7F9" stroke-width="3.77" stroke-linecap="round" stroke-linejoin="round"/>
<path d="M182.88 161.925L175.5 154.545L172.25 150.785C167.66 144.655 165.36 137.335 165.36 130.045C165.36 121.195 168.75 112.295 175.51 105.545C182.26 98.7845 191.16 95.3945 200.01 95.3945C208.86 95.3945 217.75 98.7845 224.51 105.545C231.26 112.295 234.67 121.185 234.66 130.035C234.66 136.675 232.75 143.335 228.95 149.105" stroke="#51E7F9" stroke-width="3.77" stroke-linecap="round" stroke-linejoin="round"/>
<path d="M137.18 283.951C139.73 295.531 145.49 306.521 154.5 315.531C167.08 328.101 183.51 334.371 200 334.381C216.48 334.381 232.92 328.101 245.5 315.531C258.08 302.951 264.34 286.511 264.35 270.031C264.35 255.091 259.18 240.211 248.86 228.181L245.5 224.531L191.42 170.441" stroke="#51E7F9" stroke-width="3.77" stroke-linecap="round" stroke-linejoin="round"/>
<path d="M150.09 229.422C140.48 241.202 135.66 255.552 135.66 269.942" stroke="#01BBA6" stroke-width="3.77" stroke-miterlimit="10" stroke-linecap="round"/>
<path d="M189.71 303.121C184.51 301.511 179.61 298.641 175.5 294.531C168.74 287.781 165.35 278.891 165.35 270.031C165.35 261.181 168.74 252.291 175.5 245.531" stroke="#01BBA6" stroke-width="3.77" stroke-miterlimit="10" stroke-linecap="round"/>
<path d="M148.01 92.1133C139.77 103.373 135.65 116.693 135.65 130.043C135.65 144.983 140.82 159.863 151.14 171.893L154.49 175.543L224.49 245.543L227.74 249.293C232.33 255.423 234.65 262.743 234.64 270.033C234.64 278.883 231.25 287.783 224.49 294.533C217.74 301.293 208.85 304.693 199.99 304.683" stroke="#51E7F9" stroke-width="3.77" stroke-linecap="round" stroke-linejoin="round"/>
<path d="M248.37 172.481C259.04 160.341 264.34 145.181 264.35 129.971C264.35 113.521 258.07 97.1014 245.5 84.5414C232.92 71.9714 216.48 65.7014 200 65.6914C183.52 65.6914 167.08 71.9714 154.5 84.5414" stroke="#01BBA6" stroke-width="3.77" stroke-miterlimit="10" stroke-linecap="round"/>
<path d="M208.67 56.3125C224.68 58.1825 240.22 65.2725 252.5 77.5525C266.96 92.0125 274.25 111.012 274.24 129.982C274.24 144.472 270.04 158.983 261.61 171.493" stroke="#51E7F9" stroke-width="3.77" stroke-linecap="round" stroke-linejoin="round"/>
<path d="M176.54 211.583L147.5 182.543L144.13 178.903C131.9 164.943 125.75 147.473 125.76 130.043C125.76 111.053 133.02 92.023 147.5 77.543C161.99 63.053 181.02 55.793 200 55.793" stroke="#51E7F9" stroke-width="3.77" stroke-linecap="round" stroke-linejoin="round"/>
<path d="M178.21 258.291C176.24 261.941 175.26 265.981 175.25 270.041C175.25 276.391 177.66 282.701 182.5 287.541C187.34 292.381 193.65 294.781 200 294.791C206.35 294.791 212.65 292.381 217.5 287.541C222.34 282.701 224.74 276.391 224.75 270.041C224.75 265.271 223.38 260.511 220.65 256.401L217.49 252.551L194.71 229.771L188.91 223.971L183.38 218.441" stroke="#51E7F9" stroke-width="3.77" stroke-linecap="round" stroke-linejoin="round"/>
<path d="M231.49 161.542C232.46 160.572 233.38 159.562 234.24 158.532C241.11 150.292 244.53 140.172 244.54 130.012C244.54 118.612 240.19 107.252 231.49 98.5422C222.78 89.8322 211.41 85.5022 199.99 85.4922C188.58 85.4922 177.2 89.8322 168.49 98.5422C159.78 107.252 155.45 118.622 155.45 130.042C155.45 139.902 158.69 149.732 165.19 157.842L168.49 161.552L238.49 231.542" stroke="#01BBA6" stroke-width="3.77" stroke-miterlimit="10" stroke-linecap="round"/>
</g>
<defs>
<clipPath id="clip0_570_167">
<rect width="400" height="400" fill="white"/>
</clipPath>
</defs>
</svg>
